aboutsummaryrefslogtreecommitdiffstats
path: root/2.6.4_RC2/2.6.4_RC2_test_results/beaglebone/testresults.json
diff options
context:
space:
mode:
Diffstat (limited to '2.6.4_RC2/2.6.4_RC2_test_results/beaglebone/testresults.json')
-rw-r--r--2.6.4_RC2/2.6.4_RC2_test_results/beaglebone/testresults.json438
1 files changed, 438 insertions, 0 deletions
diff --git a/2.6.4_RC2/2.6.4_RC2_test_results/beaglebone/testresults.json b/2.6.4_RC2/2.6.4_RC2_test_results/beaglebone/testresults.json
new file mode 100644
index 0000000..8dcebbc
--- /dev/null
+++ b/2.6.4_RC2/2.6.4_RC2_test_results/beaglebone/testresults.json
@@ -0,0 +1,438 @@
+{
+ "manual_bsp-hw_20191022093650": {
+ "configuration": {
+ "IMAGE_BASENAME": "core-image-sato-sdk",
+ "LAYERS": {
+ "meta": {
+ "branch": "thud",
+ "commit": "51f6145f8f99a02df1dad937684f014b0172e72a",
+ "commit_count": 52831
+ },
+ "meta-poky": {
+ "branch": "thud",
+ "commit": "51f6145f8f99a02df1dad937684f014b0172e72a",
+ "commit_count": 52831
+ },
+ "meta-yocto-bsp": {
+ "branch": "thud",
+ "commit": "51f6145f8f99a02df1dad937684f014b0172e72a",
+ "commit_count": 52831
+ }
+ },
+ "MACHINE": "beaglebone-yocto",
+ "STARTTIME": "20191022093650",
+ "TEST_MODULE": "bsp-hw",
+ "TEST_TYPE": "manual"
+ },
+ "result": {
+ "bsps-hw.bsps-hw.Add_multiple_files_in_media_player": {
+ "status": "SKIPPED"
+ },
+ "bsps-hw.bsps-hw.Boot_from_JFFS2_image": {
+ "status": "SKIPPED"
+ },
+ "bsps-hw.bsps-hw.Check_if_RTC_(Real_Time_Clock)_can_work_correctly": {
+ "status": "PASSED"
+ },
+ "bsps-hw.bsps-hw.Check_if_SATA_disk_can_work_correctly": {
+ "status": "SKIPPED"
+ },
+ "bsps-hw.bsps-hw.Check_if_target_can_support_EEPROM": {
+ "status": "SKIPPED"
+ },
+ "bsps-hw.bsps-hw.Check_if_watchdog_can_reset_the_target_system": {
+ "status": "PASSED"
+ },
+ "bsps-hw.bsps-hw.Graphics_-_ABAT": {
+ "status": "SKIPPED"
+ },
+ "bsps-hw.bsps-hw.Graphics_-_x11perf_-_2D": {
+ "status": "SKIPPED"
+ },
+ "bsps-hw.bsps-hw.Install_and_boot_from_USB-drive_to_HDD-drive": {
+ "status": "SKIPPED"
+ },
+ "bsps-hw.bsps-hw.Install_and_boot_from_USB-drive_to_SD-drive": {
+ "status": "SKIPPED"
+ },
+ "bsps-hw.bsps-hw.MicroSD_-__mount": {
+ "status": "PASSED"
+ },
+ "bsps-hw.bsps-hw.MicroSD_-__read_files": {
+ "status": "PASSED"
+ },
+ "bsps-hw.bsps-hw.MicroSD_-__umount": {
+ "status": "PASSED"
+ },
+ "bsps-hw.bsps-hw.MicroSD_-__write_files": {
+ "status": "PASSED"
+ },
+ "bsps-hw.bsps-hw.System_can_boot_up_via_NFS": {
+ "status": "SKIPPED"
+ },
+ "bsps-hw.bsps-hw.Test_Seek_bar_and_volume_control": {
+ "status": "SKIPPED"
+ },
+ "bsps-hw.bsps-hw.Test_boot_on_serial_communication_HDD": {
+ "status": "SKIPPED"
+ },
+ "bsps-hw.bsps-hw.Test_boot_on_serial_communication_SD": {
+ "status": "SKIPPED"
+ },
+ "bsps-hw.bsps-hw.Test_boot_on_serial_communication_USB": {
+ "status": "SKIPPED"
+ },
+ "bsps-hw.bsps-hw.Test_if_LAN_device_works_well_after_resume_from_suspend_state": {
+ "status": "SKIPPED"
+ },
+ "bsps-hw.bsps-hw.Test_if_usb_hid_device_works_well_after_resume_from_suspend_state": {
+ "status": "SKIPPED"
+ },
+ "bsps-hw.bsps-hw.USB_-_mount": {
+ "status": "PASSED"
+ },
+ "bsps-hw.bsps-hw.USB_-_read_files": {
+ "status": "PASSED"
+ },
+ "bsps-hw.bsps-hw.USB_-_umount": {
+ "status": "PASSED"
+ },
+ "bsps-hw.bsps-hw.USB_-_write_files": {
+ "status": "PASSED"
+ },
+ "bsps-hw.bsps-hw.X_server_can_start_up_with_runlevel_5_boot": {
+ "status": "PASSED"
+ },
+ "bsps-hw.bsps-hw.audio_-_play_(ogg)_with_HDMI": {
+ "status": "SKIPPED"
+ },
+ "bsps-hw.bsps-hw.audio_-_play_(wav)_with_HDMI": {
+ "status": "SKIPPED"
+ },
+ "bsps-hw.bsps-hw.boot_and_install_from_USB": {
+ "status": "SKIPPED"
+ },
+ "bsps-hw.bsps-hw.boot_from_runlevel_3": {
+ "status": "PASSED"
+ },
+ "bsps-hw.bsps-hw.boot_from_runlevel_5": {
+ "status": "PASSED"
+ },
+ "bsps-hw.bsps-hw.check_CPU_utilization_after_standby": {
+ "status": "SKIPPED"
+ },
+ "bsps-hw.bsps-hw.check_bash_in_image": {
+ "status": "PASSED"
+ },
+ "bsps-hw.bsps-hw.click_terminal_icon_on_X_desktop": {
+ "status": "PASSED"
+ },
+ "bsps-hw.bsps-hw.connman_offline_mode_in_connman-gnome": {
+ "status": "PASSED"
+ },
+ "bsps-hw.bsps-hw.ethernet_get_IP_in_connman_via_DHCP": {
+ "status": "PASSED"
+ },
+ "bsps-hw.bsps-hw.ethernet_static_ip_set_in_connman": {
+ "status": "PASSED"
+ },
+ "bsps-hw.bsps-hw.live_boot_from_USB": {
+ "status": "SKIPPED"
+ },
+ "bsps-hw.bsps-hw.media_player_-_play_video_(ogv)": {
+ "status": "SKIPPED"
+ },
+ "bsps-hw.bsps-hw.media_player_-_stop/play_button_(ogv)": {
+ "status": "SKIPPED"
+ },
+ "bsps-hw.bsps-hw.reboot_system": {
+ "status": "PASSED"
+ },
+ "bsps-hw.bsps-hw.rpm_-__install_dependency_package": {
+ "status": "PASSED"
+ },
+ "bsps-hw.bsps-hw.shutdown_system": {
+ "status": "PASSED"
+ },
+ "bsps-hw.bsps-hw.standby": {
+ "status": "SKIPPED"
+ },
+ "bsps-hw.bsps-hw.switch_among_multi_applications_and_desktop": {
+ "status": "PASSED"
+ },
+ "bsps-hw.bsps-hw.video_-_libva_check_(ogg_video_play)": {
+ "status": "SKIPPED"
+ }
+ }
+ },
+ "manual_compliance-test_20191022181423": {
+ "configuration": {
+ "IMAGE_BASENAME": "core-image-sato-sdk",
+ "LAYERS": {
+ "meta": {
+ "branch": "thud",
+ "commit": "51f6145f8f99a02df1dad937684f014b0172e72a",
+ "commit_count": 52831
+ },
+ "meta-poky": {
+ "branch": "thud",
+ "commit": "51f6145f8f99a02df1dad937684f014b0172e72a",
+ "commit_count": 52831
+ },
+ "meta-yocto-bsp": {
+ "branch": "thud",
+ "commit": "51f6145f8f99a02df1dad937684f014b0172e72a",
+ "commit_count": 52831
+ }
+ },
+ "MACHINE": "beaglebone-yocto",
+ "STARTTIME": "20191022181423",
+ "TEST_MODULE": "compliance-test",
+ "TEST_TYPE": "manual"
+ },
+ "result": {
+ "compliance-test.compliance-test.LSB_subset_test_suite": {
+ "status": "SKIPPED"
+ },
+ "compliance-test.compliance-test.LTP_subset_test_suite": {
+ "status": "PASSED"
+ },
+ "compliance-test.compliance-test.POSIX_subset_test_suite": {
+ "status": "PASSED"
+ },
+ "compliance-test.compliance-test.stress_test_-_- crashme_-_-Beaglebone": {
+ "status": "PASSED"
+ },
+ "compliance-test.compliance-test.stress_test_-_Genericx86-64": {
+ "status": "SKIPPED"
+ },
+ "compliance-test.compliance-test.stress_test_-_ltp_-Beaglebone": {
+ "status": "PASSED"
+ }
+ }
+ },
+ "runtime_core-image-sato-sdk_beaglebone-yocto_20191021053245": {
+ "configuration": {
+ "DISTRO": "poky",
+ "HOST_DISTRO": "ubuntu-16.04",
+ "IMAGE_BASENAME": "core-image-sato-sdk",
+ "IMAGE_PKGTYPE": "rpm",
+ "LAYERS": {
+ "meta": {
+ "branch": "thud",
+ "commit": "51f6145f8f99a02df1dad937684f014b0172e72a",
+ "commit_count": 52831
+ },
+ "meta-poky": {
+ "branch": "thud",
+ "commit": "51f6145f8f99a02df1dad937684f014b0172e72a",
+ "commit_count": 52831
+ },
+ "meta-yocto-bsp": {
+ "branch": "thud",
+ "commit": "51f6145f8f99a02df1dad937684f014b0172e72a",
+ "commit_count": 52831
+ }
+ },
+ "MACHINE": "beaglebone-yocto",
+ "STARTTIME": "20191021053245",
+ "TEST_TYPE": "runtime"
+ },
+ "result": {
+ "apt.AptRepoTest.test_apt_install_from_repo": {
+ "log": "Test requires apt to be installed",
+ "status": "SKIPPED"
+ },
+ "buildcpio.BuildCpioTest.test_cpio": {
+ "status": "PASSED"
+ },
+ "buildgalculator.GalculatorTest.test_galculator": {
+ "status": "PASSED"
+ },
+ "buildlzip.BuildLzipTest.test_lzip": {
+ "status": "PASSED"
+ },
+ "connman.ConnmanTest.test_connmand_help": {
+ "status": "PASSED"
+ },
+ "connman.ConnmanTest.test_connmand_running": {
+ "status": "PASSED"
+ },
+ "date.DateTest.test_date": {
+ "status": "PASSED"
+ },
+ "df.DfTest.test_df": {
+ "status": "PASSED"
+ },
+ "dnf.DnfBasicTest.test_dnf_help": {
+ "status": "PASSED"
+ },
+ "dnf.DnfBasicTest.test_dnf_history": {
+ "status": "PASSED"
+ },
+ "dnf.DnfBasicTest.test_dnf_info": {
+ "status": "PASSED"
+ },
+ "dnf.DnfBasicTest.test_dnf_search": {
+ "status": "PASSED"
+ },
+ "dnf.DnfBasicTest.test_dnf_version": {
+ "status": "PASSED"
+ },
+ "dnf.DnfRepoTest.test_dnf_exclude": {
+ "status": "PASSED"
+ },
+ "dnf.DnfRepoTest.test_dnf_install": {
+ "status": "PASSED"
+ },
+ "dnf.DnfRepoTest.test_dnf_install_dependency": {
+ "status": "PASSED"
+ },
+ "dnf.DnfRepoTest.test_dnf_install_from_disk": {
+ "status": "PASSED"
+ },
+ "dnf.DnfRepoTest.test_dnf_install_from_http": {
+ "status": "PASSED"
+ },
+ "dnf.DnfRepoTest.test_dnf_installroot": {
+ "status": "PASSED"
+ },
+ "dnf.DnfRepoTest.test_dnf_makecache": {
+ "status": "PASSED"
+ },
+ "dnf.DnfRepoTest.test_dnf_reinstall": {
+ "status": "PASSED"
+ },
+ "dnf.DnfRepoTest.test_dnf_repoinfo": {
+ "status": "PASSED"
+ },
+ "gcc.GccCompileTest.test_gcc_compile": {
+ "status": "PASSED"
+ },
+ "gcc.GccCompileTest.test_gpp2_compile": {
+ "status": "PASSED"
+ },
+ "gcc.GccCompileTest.test_gpp_compile": {
+ "status": "PASSED"
+ },
+ "gcc.GccCompileTest.test_make": {
+ "status": "PASSED"
+ },
+ "gi.GObjectIntrospectionTest.test_python": {
+ "status": "PASSED"
+ },
+ "kernelmodule.KernelModuleTest.test_kernel_module": {
+ "status": "PASSED"
+ },
+ "ldd.LddTest.test_ldd": {
+ "status": "PASSED"
+ },
+ "logrotate.LogrotateTest.test_1_logrotate_setup": {
+ "status": "PASSED"
+ },
+ "logrotate.LogrotateTest.test_2_logrotate": {
+ "status": "PASSED"
+ },
+ "oe_syslog.SyslogTest.test_syslog_running": {
+ "status": "PASSED"
+ },
+ "oe_syslog.SyslogTestConfig.test_syslog_logger": {
+ "status": "PASSED"
+ },
+ "oe_syslog.SyslogTestConfig.test_syslog_restart": {
+ "status": "PASSED"
+ },
+ "oe_syslog.SyslogTestConfig.test_syslog_startup_config": {
+ "status": "PASSED"
+ },
+ "opkg.OpkgRepoTest.test_opkg_install_from_repo": {
+ "log": "Test requires opkg to be installed",
+ "status": "SKIPPED"
+ },
+ "pam.PamBasicTest.test_pam": {
+ "log": "Test requires pam to be in DISTRO_FEATURES",
+ "status": "SKIPPED"
+ },
+ "parselogs.ParseLogsTest.test_parselogs": {
+ "log": "Traceback (most recent call last):\n File \"/buildarea4/yzhao1/yocto/thud/poky/meta/lib/oeqa/core/decorator/__init__.py\", line 32, in wrapped_f\n return func(*args, **kwargs)\n File \"/buildarea4/yzhao1/yocto/thud/poky/meta/lib/oeqa/core/decorator/__init__.py\", line 32, in wrapped_f\n return func(*args, **kwargs)\n File \"/buildarea4/yzhao1/yocto/thud/poky/meta/lib/oeqa/runtime/cases/parselogs.py\", line 353, in test_parselogs\n self.assertEqual(errcount, 0, msg=self.msg)\nAssertionError: 8 != 0 : No ignore list found for this machine, using default\nNo ignore list found for this machine, using default\nNo ignore list found for this machine, using default\nNo ignore list found for this machine, using default\nNo ignore list found for this machine, using default\nNo ignore list found for this machine, using default\nNo ignore list found for this machine, using default\nNo ignore list found for this machine, using default\nLog: /buildarea4/yzhao1/yocto/thud/build-beaglebone/tmp/work/beaglebone_yocto-poky-linux-gnueabi/core-image-sato-sdk/1.0-r0/target_logs/Xorg.0.log\n-----------------------\nCentral error: [ 22.368] (EE) modeset(0): glamor initialization failed\n***********************\n[ 21.856] (**) modeset(0): Depth 16, (--) framebuffer bpp 16\n[ 21.856] (==) modeset(0): RGB weight 565\n[ 21.856] (==) modeset(0): Default visual is TrueColor\n[ 21.856] (II) Loading sub module \"glamoregl\"\n[ 21.856] (II) LoadModule: \"glamoregl\"\n[ 21.857] (II) Loading /usr/lib/xorg/modules/libglamoregl.so\n[ 22.008] (II) Module glamoregl: vendor=\"X.Org Foundation\"\n[ 22.008] \tcompiled for 1.20.1, module version = 1.0.1\n[ 22.008] \tABI class: X.Org ANSI C Emulation, version 0.4\n[ 22.345] (EE) modeset(0): Failed to make EGL context current\n[ 22.368] (EE) modeset(0): glamor initialization failed\n[ 22.368] (II) modeset(0): ShadowFB: preferred NO, enabled NO\n[ 22.405] (II) modeset(0): Output HDMI-1 using monitor section Builtin Default Monitor\n[ 22.437] (II) modeset(0): EDID for output HDMI-1\n[ 22.437] (II) modeset(0): Manufacturer: DEL Model: f011 Serial#: 809779532\n[ 22.437] (II) modeset(0): Year: 2009 Week: 29\n[ 22.438] (II) modeset(0): EDID Version: 1.3\n[ 22.438] (II) modeset(0): Digital Display Input\n[ 22.438] (II) modeset(0): Max Image Size [cm]: horiz.: 47 vert.: 30\n[ 22.438] (II) modeset(0): Gamma: 2.20\n[ 22.438] (II) modeset(0): DPMS capabilities: Off\n\n***********************\nCentral error: [ 22.345] (EE) modeset(0): Failed to make EGL context current\n***********************\n\t\"Builtin Default fbdev Screen 0\" for depth/fbbpp 16/16\n[ 21.856] (**) modeset(0): Depth 16, (--) framebuffer bpp 16\n[ 21.856] (==) modeset(0): RGB weight 565\n[ 21.856] (==) modeset(0): Default visual is TrueColor\n[ 21.856] (II) Loading sub module \"glamoregl\"\n[ 21.856] (II) LoadModule: \"glamoregl\"\n[ 21.857] (II) Loading /usr/lib/xorg/modules/libglamoregl.so\n[ 22.008] (II) Module glamoregl: vendor=\"X.Org Foundation\"\n[ 22.008] \tcompiled for 1.20.1, module version = 1.0.1\n[ 22.008] \tABI class: X.Org ANSI C Emulation, version 0.4\n[ 22.345] (EE) modeset(0): Failed to make EGL context current\n[ 22.368] (EE) modeset(0): glamor initialization failed\n[ 22.368] (II) modeset(0): ShadowFB: preferred NO, enabled NO\n[ 22.405] (II) modeset(0): Output HDMI-1 using monitor section Builtin Default Monitor\n[ 22.437] (II) modeset(0): EDID for output HDMI-1\n[ 22.437] (II) modeset(0): Manufacturer: DEL Model: f011 Serial#: 809779532\n[ 22.437] (II) modeset(0): Year: 2009 Week: 29\n[ 22.438] (II) modeset(0): EDID Version: 1.3\n[ 22.438] (II) modeset(0): Digital Display Input\n[ 22.438] (II) modeset(0): Max Image Size [cm]: horiz.: 47 vert.: 30\n[ 22.438] (II) modeset(0): Gamma: 2.20\n\n***********************\nLog: /buildarea4/yzhao1/yocto/thud/build-beaglebone/tmp/work/beaglebone_yocto-poky-linux-gnueabi/core-image-sato-sdk/1.0-r0/target_logs/dmesg_output.log\n-----------------------\nCentral error: [ 3.324290] platform regulatory.0: Direct firmware load for regulatory.db failed with error -2\n***********************\n[ 3.261647] omap_i2c 4819c000.i2c: bus 2 rev0.11 at 100 kHz\n[ 3.274507] musb-hdrc musb-hdrc.1: MUSB HDRC host driver\n[ 3.278842] musb-hdrc musb-hdrc.1: new USB bus registered, assigned bus number 1\n[ 3.286356] hub 1-0:1.0: USB hub found\n[ 3.289035] hub 1-0:1.0: 1 port detected\n[ 3.293199] console [netcon0] enabled\n[ 3.295737] netconsole: network logging started\n[ 3.299555] omap_rtc 44e3e000.rtc: setting system clock to 2000-01-01 00:00:01 UTC (946684801)\n[ 3.307850] cfg80211: Loading compiled-in X.509 certificates for regulatory database\n[ 3.318306] cfg80211: Loaded X.509 cert 'sforshee: 00b28ddf47aef9cea7'\n[ 3.324290] platform regulatory.0: Direct firmware load for regulatory.db failed with error -2\n[ 3.333805] cfg80211: failed to load regulatory.db\n[ 3.349863] EXT4-fs (mmcblk0p2): mounted filesystem with ordered data mode. Opts: (null)\n[ 3.357559] VFS: Mounted root (ext4 filesystem) readonly on device 179:2.\n[ 3.372410] devtmpfs: mounted\n[ 3.378284] Freeing unused kernel memory: 1024K\n[ 3.732041] usb 1-1: new high-speed USB device number 2 using musb-hdrc\n[ 3.913384] hub 1-1:1.0: USB hub found\n[ 3.916074] hub 1-1:1.0: 7 ports detected\n[ 4.261902] usb 1-1.4: new low-speed USB device number 3 using musb-hdrc\n[ 4.401330] input: USB Optical Mouse as /devices/platform/ocp/47400000.usb/47401c00.usb/musb-hdrc.1/usb1/1-1/1-1.4/1-1.4:1.0/0003:0461:4D81.0001/input/input0\n\n***********************\nCentral error: [ 0.422123] l4_wkup_cm:clk:0010:0: failed to disable\n***********************\n[ 0.102741] clocksource: jiffies: mask: 0xffffffff max_cycles: 0xffffffff, max_idle_ns: 19112604462750000 ns\n[ 0.102798] futex hash table entries: 256 (order: -1, 3072 bytes)\n[ 0.104233] xor: measuring software checksum speed\n[ 0.199149] arm4regs : 1218.800 MB/sec\n[ 0.299089] 8regs : 902.800 MB/sec\n[ 0.399087] 32regs : 1172.400 MB/sec\n[ 0.399105] xor: using function: arm4regs (1218.800 MB/sec)\n[ 0.399134] pinctrl core: initialized pinctrl subsystem\n[ 0.400252] NET: Registered protocol family 16\n[ 0.402694] DMA: preallocated 256 KiB pool for atomic coherent allocations\n[ 0.422123] l4_wkup_cm:clk:0010:0: failed to disable\n[ 0.475791] cpuidle: using governor ladder\n[ 0.475879] cpuidle: using governor menu\n[ 0.481406] OMAP GPIO hardware version 0.1\n[ 0.490794] hw-breakpoint: debug architecture 0x4 unsupported.\n[ 0.669354] raid6: int32x1 gen() 209 MB/s\n[ 0.839293] raid6: int32x1 xor() 143 MB/s\n[ 1.009252] raid6: int32x2 gen() 223 MB/s\n[ 1.179226] raid6: int32x2 xor() 161 MB/s\n[ 1.349107] raid6: int32x4 gen() 190 MB/s\n[ 1.519273] raid6: int32x4 xor() 133 MB/s\n\n***********************\nCentral error: [ 3.333805] cfg80211: failed to load regulatory.db\n***********************\n[ 3.274507] musb-hdrc musb-hdrc.1: MUSB HDRC host driver\n[ 3.278842] musb-hdrc musb-hdrc.1: new USB bus registered, assigned bus number 1\n[ 3.286356] hub 1-0:1.0: USB hub found\n[ 3.289035] hub 1-0:1.0: 1 port detected\n[ 3.293199] console [netcon0] enabled\n[ 3.295737] netconsole: network logging started\n[ 3.299555] omap_rtc 44e3e000.rtc: setting system clock to 2000-01-01 00:00:01 UTC (946684801)\n[ 3.307850] cfg80211: Loading compiled-in X.509 certificates for regulatory database\n[ 3.318306] cfg80211: Loaded X.509 cert 'sforshee: 00b28ddf47aef9cea7'\n[ 3.324290] platform regulatory.0: Direct firmware load for regulatory.db failed with error -2\n[ 3.333805] cfg80211: failed to load regulatory.db\n[ 3.349863] EXT4-fs (mmcblk0p2): mounted filesystem with ordered data mode. Opts: (null)\n[ 3.357559] VFS: Mounted root (ext4 filesystem) readonly on device 179:2.\n[ 3.372410] devtmpfs: mounted\n[ 3.378284] Freeing unused kernel memory: 1024K\n[ 3.732041] usb 1-1: new high-speed USB device number 2 using musb-hdrc\n[ 3.913384] hub 1-1:1.0: USB hub found\n[ 3.916074] hub 1-1:1.0: 7 ports detected\n[ 4.261902] usb 1-1.4: new low-speed USB device number 3 using musb-hdrc\n[ 4.401330] input: USB Optical Mouse as /devices/platform/ocp/47400000.usb/47401c00.usb/musb-hdrc.1/usb1/1-1/1-1.4/1-1.4:1.0/0003:0461:4D81.0001/input/input0\n[ 4.426026] hid-generic 0003:0461:4D81.0001: input: USB HID v1.11 Mouse [USB Optical Mouse] on usb-musb-hdrc.1-1.4/input0\n\n***********************\nLog: /buildarea4/yzhao1/yocto/thud/build-beaglebone/tmp/work/beaglebone_yocto-poky-linux-gnueabi/core-image-sato-sdk/1.0-r0/target_logs/dmesg\n-----------------------\nCentral error: [ 3.324290] platform regulatory.0: Direct firmware load for regulatory.db failed with error -2\n***********************\n[ 3.261647] omap_i2c 4819c000.i2c: bus 2 rev0.11 at 100 kHz\n[ 3.274507] musb-hdrc musb-hdrc.1: MUSB HDRC host driver\n[ 3.278842] musb-hdrc musb-hdrc.1: new USB bus registered, assigned bus number 1\n[ 3.286356] hub 1-0:1.0: USB hub found\n[ 3.289035] hub 1-0:1.0: 1 port detected\n[ 3.293199] console [netcon0] enabled\n[ 3.295737] netconsole: network logging started\n[ 3.299555] omap_rtc 44e3e000.rtc: setting system clock to 2000-01-01 00:00:01 UTC (946684801)\n[ 3.307850] cfg80211: Loading compiled-in X.509 certificates for regulatory database\n[ 3.318306] cfg80211: Loaded X.509 cert 'sforshee: 00b28ddf47aef9cea7'\n[ 3.324290] platform regulatory.0: Direct firmware load for regulatory.db failed with error -2\n[ 3.333805] cfg80211: failed to load regulatory.db\n[ 3.349863] EXT4-fs (mmcblk0p2): mounted filesystem with ordered data mode. Opts: (null)\n[ 3.357559] VFS: Mounted root (ext4 filesystem) readonly on device 179:2.\n[ 3.372410] devtmpfs: mounted\n[ 3.378284] Freeing unused kernel memory: 1024K\n[ 3.732041] usb 1-1: new high-speed USB device number 2 using musb-hdrc\n[ 3.913384] hub 1-1:1.0: USB hub found\n[ 3.916074] hub 1-1:1.0: 7 ports detected\n[ 4.261902] usb 1-1.4: new low-speed USB device number 3 using musb-hdrc\n[ 4.401330] input: USB Optical Mouse as /devices/platform/ocp/47400000.usb/47401c00.usb/musb-hdrc.1/usb1/1-1/1-1.4/1-1.4:1.0/0003:0461:4D81.0001/input/input0\n\n***********************\nCentral error: [ 0.422123] l4_wkup_cm:clk:0010:0: failed to disable\n***********************\n[ 0.102741] clocksource: jiffies: mask: 0xffffffff max_cycles: 0xffffffff, max_idle_ns: 19112604462750000 ns\n[ 0.102798] futex hash table entries: 256 (order: -1, 3072 bytes)\n[ 0.104233] xor: measuring software checksum speed\n[ 0.199149] arm4regs : 1218.800 MB/sec\n[ 0.299089] 8regs : 902.800 MB/sec\n[ 0.399087] 32regs : 1172.400 MB/sec\n[ 0.399105] xor: using function: arm4regs (1218.800 MB/sec)\n[ 0.399134] pinctrl core: initialized pinctrl subsystem\n[ 0.400252] NET: Registered protocol family 16\n[ 0.402694] DMA: preallocated 256 KiB pool for atomic coherent allocations\n[ 0.422123] l4_wkup_cm:clk:0010:0: failed to disable\n[ 0.475791] cpuidle: using governor ladder\n[ 0.475879] cpuidle: using governor menu\n[ 0.481406] OMAP GPIO hardware version 0.1\n[ 0.490794] hw-breakpoint: debug architecture 0x4 unsupported.\n[ 0.669354] raid6: int32x1 gen() 209 MB/s\n[ 0.839293] raid6: int32x1 xor() 143 MB/s\n[ 1.009252] raid6: int32x2 gen() 223 MB/s\n[ 1.179226] raid6: int32x2 xor() 161 MB/s\n[ 1.349107] raid6: int32x4 gen() 190 MB/s\n[ 1.519273] raid6: int32x4 xor() 133 MB/s\n\n***********************\nCentral error: [ 3.333805] cfg80211: failed to load regulatory.db\n***********************\n[ 3.274507] musb-hdrc musb-hdrc.1: MUSB HDRC host driver\n[ 3.278842] musb-hdrc musb-hdrc.1: new USB bus registered, assigned bus number 1\n[ 3.286356] hub 1-0:1.0: USB hub found\n[ 3.289035] hub 1-0:1.0: 1 port detected\n[ 3.293199] console [netcon0] enabled\n[ 3.295737] netconsole: network logging started\n[ 3.299555] omap_rtc 44e3e000.rtc: setting system clock to 2000-01-01 00:00:01 UTC (946684801)\n[ 3.307850] cfg80211: Loading compiled-in X.509 certificates for regulatory database\n[ 3.318306] cfg80211: Loaded X.509 cert 'sforshee: 00b28ddf47aef9cea7'\n[ 3.324290] platform regulatory.0: Direct firmware load for regulatory.db failed with error -2\n[ 3.333805] cfg80211: failed to load regulatory.db\n[ 3.349863] EXT4-fs (mmcblk0p2): mounted filesystem with ordered data mode. Opts: (null)\n[ 3.357559] VFS: Mounted root (ext4 filesystem) readonly on device 179:2.\n[ 3.372410] devtmpfs: mounted\n[ 3.378284] Freeing unused kernel memory: 1024K\n[ 3.732041] usb 1-1: new high-speed USB device number 2 using musb-hdrc\n[ 3.913384] hub 1-1:1.0: USB hub found\n[ 3.916074] hub 1-1:1.0: 7 ports detected\n[ 4.261902] usb 1-1.4: new low-speed USB device number 3 using musb-hdrc\n[ 4.401330] input: USB Optical Mouse as /devices/platform/ocp/47400000.usb/47401c00.usb/musb-hdrc.1/usb1/1-1/1-1.4/1-1.4:1.0/0003:0461:4D81.0001/input/input0\n[ 4.426026] hid-generic 0003:0461:4D81.0001: input: USB HID v1.11 Mouse [USB Optical Mouse] on usb-musb-hdrc.1-1.4/input0\n\n***********************\n8 errors found in logs.\n\nStdout:\nMachine information: \n*******************************\nMachine name: beaglebone-yocto\nCPU: ARMv7 Processor rev 2 (v7l)\nArch: armv7l\nPhysical cores: \nLogical cores: 1\n*******************************\n\n",
+ "status": "FAILED"
+ },
+ "perl.PerlTest.test_perl_works": {
+ "status": "PASSED"
+ },
+ "ping.PingTest.test_ping": {
+ "status": "PASSED"
+ },
+ "ptest.PtestRunnerTest.test_ptestrunner": {
+ "log": "Test requires ptest-runner to be installed",
+ "status": "SKIPPED"
+ },
+ "python.PythonTest.test_python3": {
+ "status": "PASSED"
+ },
+ "rpm.RpmBasicTest.test_rpm_help": {
+ "status": "PASSED"
+ },
+ "rpm.RpmBasicTest.test_rpm_query": {
+ "status": "PASSED"
+ },
+ "rpm.RpmInstallRemoveTest.test_check_rpm_install_removal_log_file_size": {
+ "status": "PASSED"
+ },
+ "rpm.RpmInstallRemoveTest.test_rpm_install": {
+ "status": "PASSED"
+ },
+ "rpm.RpmInstallRemoveTest.test_rpm_query_nonroot": {
+ "status": "PASSED"
+ },
+ "rpm.RpmInstallRemoveTest.test_rpm_remove": {
+ "status": "PASSED"
+ },
+ "scp.ScpTest.test_scp_file": {
+ "status": "PASSED"
+ },
+ "ssh.SSHTest.test_ssh": {
+ "status": "PASSED"
+ },
+ "stap.StapTest.test_stap": {
+ "log": "Traceback (most recent call last):\n File \"/buildarea4/yzhao1/yocto/thud/poky/meta/lib/oeqa/core/decorator/__init__.py\", line 32, in wrapped_f\n return func(*args, **kwargs)\n File \"/buildarea4/yzhao1/yocto/thud/poky/meta/lib/oeqa/core/decorator/__init__.py\", line 32, in wrapped_f\n return func(*args, **kwargs)\n File \"/buildarea4/yzhao1/yocto/thud/poky/meta/lib/oeqa/core/decorator/__init__.py\", line 32, in wrapped_f\n return func(*args, **kwargs)\n File \"/buildarea4/yzhao1/yocto/thud/poky/meta/lib/oeqa/core/decorator/__init__.py\", line 32, in wrapped_f\n return func(*args, **kwargs)\n File \"/buildarea4/yzhao1/yocto/thud/poky/meta/lib/oeqa/runtime/cases/stap.py\", line 35, in test_stap\n self.assertEqual(status, 0, msg='\\n'.join([cmd, output]))\nAssertionError: 1 != 0 : stap --disable-cache -DSTP_NO_VERREL_CHECK /tmp/hello.stp\nWARNING: Kernel function symbol table missing [man warning::symbols]\n/tmp/ccVWqfj9.s: Assembler messages:\n/tmp/ccVWqfj9.s:1055: Error: selected processor does not support `cpsid i' in ARM mode\n/tmp/ccVWqfj9.s:1142: Error: selected processor does not support `cpsid i' in ARM mode\n/tmp/ccVWqfj9.s:1206: Error: selected processor does not support `cpsid i' in ARM mode\n/tmp/ccVWqfj9.s:1288: Error: selected processor does not support `cpsid i' in ARM mode\n/tmp/ccVWqfj9.s:2361: Error: selected processor does not support `ldrex r0,[r2]' in ARM mode\n/tmp/ccVWqfj9.s:2364: Error: selected processor does not support `strexeq ip,r1,[r2]' in ARM mode\n/tmp/ccVWqfj9.s:2461: Error: selected processor does not support `ldrex r2,[r3]' in ARM mode\n/tmp/ccVWqfj9.s:2463: Error: selected processor does not support `strex r1,r2,[r3]' in ARM mode\n/tmp/ccVWqfj9.s:2474: Error: selected processor does not support `ldrex r2,[r3]' in ARM mode\n/tmp/ccVWqfj9.s:2476: Error: selected processor does not support `strex r1,r2,[r3]' in ARM mode\n/tmp/ccVWqfj9.s:2524: Error: selected processor does not support `cpsid i' in ARM mode\n/tmp/ccVWqfj9.s:2572: Error: selected processor does not support `ldrex r3,[r4]' in ARM mode\n/tmp/ccVWqfj9.s:2574: Error: selected processor does not support `strex r2,r3,[r4]' in ARM mode\n/tmp/ccVWqfj9.s:2630: Error: selected processor does not support `ldrex r3,[r4]' in ARM mode\n/tmp/ccVWqfj9.s:2632: Error: selected processor does not support `strex r2,r3,[r4]' in ARM mode\n/tmp/ccVWqfj9.s:2682: Error: selected processor does not support `cpsid i' in ARM mode\n/tmp/ccVWqfj9.s:2717: Error: selected processor does not support `isb ' in ARM mode\n/tmp/ccVWqfj9.s:2730: Error: selected processor does not support `isb ' in ARM mode\n/tmp/ccVWqfj9.s:2751: Error: selected processor does not support `ldrex r3,[r5]' in ARM mode\n/tmp/ccVWqfj9.s:2753: Error: selected processor does not support `strex r2,r3,[r5]' in ARM mode\n/tmp/ccVWqfj9.s:2806: Error: selected processor does not support `ldrex r1,[r2]' in ARM mode\n/tmp/ccVWqfj9.s:2808: Error: selected processor does not support `strex r0,r1,[r2]' in ARM mode\n/tmp/ccVWqfj9.s:2880: Error: selected processor does not support `ldrex r1,[r2]' in ARM mode\n/tmp/ccVWqfj9.s:2882: Error: selected processor does not support `strex r0,r1,[r2]' in ARM mode\n/tmp/ccVWqfj9.s:2894: Error: selected processor does not support `ldrex r1,[r2]' in ARM mode\n/tmp/ccVWqfj9.s:2896: Error: selected processor does not support `strex r0,r1,[r2]' in ARM mode\n/tmp/ccVWqfj9.s:3472: Error: selected processor does not support `isb ' in ARM mode\n/tmp/ccVWqfj9.s:3492: Error: selected processor does not support `isb ' in ARM mode\n/tmp/ccVWqfj9.s:3578: Error: selected processor does not support `isb ' in ARM mode\n/tmp/ccVWqfj9.s:3598: Error: selected processor does not support `isb ' in ARM mode\n/tmp/ccVWqfj9.s:3820: Error: selected processor does not support `cpsid i' in ARM mode\n/tmp/ccVWqfj9.s:3893: Error: selected processor does not support `ldrex r3,[r6]' in ARM mode\n/tmp/ccVWqfj9.s:3895: Error: selected processor does not support `strex r2,r3,[r6]' in ARM mode\n/tmp/ccVWqfj9.s:3996: Error: selected processor does not support `ldrex r1,[r2]' in ARM mode\n/tmp/ccVWqfj9.s:3998: Error: selected processor does not support `strex r0,r1,[r2]' in ARM mode\n/tmp/ccVWqfj9.s:4343: Error: selected processor does not support `cpsid i' in ARM mode\n/tmp/ccVWqfj9.s:4397: Error: selected processor does not support `cpsid i' in ARM mode\n/tmp/ccVWqfj9.s:4439: Error: selected processor does not support `ldrex r3,[r5]' in ARM mode\n/tmp/ccVWqfj9.s:4441: Error: selected processor does not support `strex r2,r3,[r5]' in ARM mode\n/tmp/ccVWqfj9.s:4509: Error: selected processor does not support `ldrex r3,[r5]' in ARM mode\n/tmp/ccVWqfj9.s:4511: Error: selected processor does not support `strex r2,r3,[r5]' in ARM mode\n/tmp/ccVWqfj9.s:4608: Error: selected processor does not support `cpsid i' in ARM mode\n/tmp/ccVWqfj9.s:4645: Error: selected processor does not support `ldrex r3,[r4]' in ARM mode\n/tmp/ccVWqfj9.s:4647: Error: selected processor does not support `strex r2,r3,[r4]' in ARM mode\n/tmp/ccVWqfj9.s:5572: Error: selected processor does not support `ldrex r2,[r3]' in ARM mode\n/tmp/ccVWqfj9.s:5574: Error: selected processor does not support `strex r1,r2,[r3]' in ARM mode\n/tmp/ccVWqfj9.s:5587: Error: selected processor does not support `cpsid i' in ARM mode\n/tmp/ccVWqfj9.s:5617: Error: selected processor does not support `ldrex r3,[r4]' in ARM mode\n/tmp/ccVWqfj9.s:5619: Error: selected processor does not support `strex r2,r3,[r4]' in ARM mode\n/tmp/ccVWqfj9.s:5685: Error: selected processor does not support `ldrex r2,[r3]' in ARM mode\n/tmp/ccVWqfj9.s:5687: Error: selected processor does not support `strex r1,r2,[r3]' in ARM mode\n/tmp/ccVWqfj9.s:5751: Error: selected processor does not support `ldrex r0,[r2]' in ARM mode\n/tmp/ccVWqfj9.s:5754: Error: selected processor does not support `strexeq ip,r1,[r2]' in ARM mode\n/tmp/ccVWqfj9.s:6038: Error: selected processor does not support `isb ' in ARM mode\n/tmp/ccVWqfj9.s:6050: Error: selected processor does not support `isb ' in ARM mode\n/tmp/ccVWqfj9.s:6115: Error: selected processor does not support `isb ' in ARM mode\n/tmp/ccVWqfj9.s:6128: Error: selected processor does not support `isb ' in ARM mode\n/tmp/ccVWqfj9.s:6157: Error: selected processor does not support `ldrex r2,[r3]' in ARM mode\n/tmp/ccVWqfj9.s:6160: Error: selected processor does not support `strexeq r0,r1,[r3]' in ARM mode\n/tmp/ccVWqfj9.s:6267: Error: selected processor does not support `ldrex r2,[r8]' in ARM mode\n/tmp/ccVWqfj9.s:6270: Error: selected processor does not support `strexeq r5,r3,[r8]' in ARM mode\n/tmp/ccVWqfj9.s:6331: Error: selected processor does not support `isb ' in ARM mode\n/tmp/ccVWqfj9.s:6344: Error: selected processor does not support `isb ' in ARM mode\n/tmp/ccVWqfj9.s:6387: Error: selected processor does not support `isb ' in ARM mode\n/tmp/ccVWqfj9.s:6401: Error: selected processor does not support `isb ' in ARM mode\n/tmp/ccVWqfj9.s:6506: Error: selected processor does not support `isb ' in ARM mode\n/tmp/ccVWqfj9.s:6519: Error: selected processor does not support `isb ' in ARM mode\n/tmp/ccVWqfj9.s:6579: Error: selected processor does not support `isb ' in ARM mode\n/tmp/ccVWqfj9.s:6593: Error: selected processor does not support `isb ' in ARM mode\n/tmp/ccVWqfj9.s:6640: Error: selected processor does not support `isb ' in ARM mode\n/tmp/ccVWqfj9.s:6653: Error: selected processor does not support `isb ' in ARM mode\n/tmp/ccVWqfj9.s:6698: Error: selected processor does not support `isb ' in ARM mode\n/tmp/ccVWqfj9.s:6712: Error: selected processor does not support `isb ' in ARM mode\n/tmp/ccVWqfj9.s:6756: Error: selected processor does not support `ldrex r8,[r2]' in ARM mode\n/tmp/ccVWqfj9.s:6759: Error: selected processor does not support `strexeq r1,r3,[r2]' in ARM mode\nmake[1]: *** [scripts/Makefile.build:315: /tmp/stapwom38q/stap_21746_src.o] Error 1\nmake: *** [Makefile:1508: _module_/tmp/stapwom38q] Error 2\nWARNING: kbuild exited with status: 2\nPass 4: compilation failed. [man error::pass4]\n",
+ "status": "FAILED"
+ },
+ "systemd.SystemdBasicTests.test_systemd_basic": {
+ "log": "systemd is not the init manager for this image",
+ "status": "SKIPPED"
+ },
+ "systemd.SystemdBasicTests.test_systemd_failed": {
+ "log": "Test case systemd.SystemdBasicTests.test_systemd_failed depends on systemd.SystemdBasicTests.test_systemd_basic but it didn't pass/run.",
+ "status": "SKIPPED"
+ },
+ "systemd.SystemdBasicTests.test_systemd_list": {
+ "log": "Test case systemd.SystemdBasicTests.test_systemd_list depends on systemd.SystemdBasicTests.test_systemd_basic but it didn't pass/run.",
+ "status": "SKIPPED"
+ },
+ "systemd.SystemdJournalTests.test_systemd_boot_time": {
+ "log": "Test case systemd.SystemdJournalTests.test_systemd_boot_time depends on systemd.SystemdBasicTests.test_systemd_basic but it didn't pass/run.",
+ "status": "SKIPPED"
+ },
+ "systemd.SystemdJournalTests.test_systemd_journal": {
+ "log": "Test case systemd.SystemdJournalTests.test_systemd_journal depends on systemd.SystemdBasicTests.test_systemd_basic but it didn't pass/run.",
+ "status": "SKIPPED"
+ },
+ "systemd.SystemdServiceTests.test_systemd_disable_enable": {
+ "log": "Test case systemd.SystemdServiceTests.test_systemd_disable_enable depends on systemd.SystemdServiceTests.test_systemd_status but it didn't pass/run.",
+ "status": "SKIPPED"
+ },
+ "systemd.SystemdServiceTests.test_systemd_status": {
+ "log": "Test case systemd.SystemdServiceTests.test_systemd_status depends on systemd.SystemdBasicTests.test_systemd_basic but it didn't pass/run.",
+ "status": "SKIPPED"
+ },
+ "systemd.SystemdServiceTests.test_systemd_stop_start": {
+ "log": "Test case systemd.SystemdServiceTests.test_systemd_stop_start depends on systemd.SystemdServiceTests.test_systemd_status but it didn't pass/run.",
+ "status": "SKIPPED"
+ },
+ "xorg.XorgTest.test_xorg_running": {
+ "status": "PASSED"
+ }
+ }
+ }
+} \ No newline at end of file