aboutsummaryrefslogtreecommitdiffstats
path: root/3.4_M2_RC1/3.4_M2.rc1_test_results/minnowboard32/testresults.json
diff options
context:
space:
mode:
Diffstat (limited to '3.4_M2_RC1/3.4_M2.rc1_test_results/minnowboard32/testresults.json')
-rw-r--r--3.4_M2_RC1/3.4_M2.rc1_test_results/minnowboard32/testresults.json326
1 files changed, 326 insertions, 0 deletions
diff --git a/3.4_M2_RC1/3.4_M2.rc1_test_results/minnowboard32/testresults.json b/3.4_M2_RC1/3.4_M2.rc1_test_results/minnowboard32/testresults.json
new file mode 100644
index 0000000000..76c97e27a2
--- /dev/null
+++ b/3.4_M2_RC1/3.4_M2.rc1_test_results/minnowboard32/testresults.json
@@ -0,0 +1,326 @@
+{
+ "runtime_core-image-sato-sdk_genericx86_20210722065114": {
+ "configuration": {
+ "DISTRO": "poky",
+ "HOST_DISTRO": "ubuntu-18.04",
+ "IMAGE_BASENAME": "core-image-sato-sdk",
+ "IMAGE_PKGTYPE": "rpm",
+ "LAYERS": {
+ "meta": {
+ "branch": "master",
+ "commit": "1ad79313a5c3e6a453fbeb44caac5c5bbad46d3c",
+ "commit_count": 62691
+ },
+ "meta-intel": {
+ "branch": "master",
+ "commit": "94c097a82cf9167fa567c2af80d5e39a3fbbc11f",
+ "commit_count": 2593
+ },
+ "meta-poky": {
+ "branch": "master",
+ "commit": "1ad79313a5c3e6a453fbeb44caac5c5bbad46d3c",
+ "commit_count": 62691
+ },
+ "meta-yocto-bsp": {
+ "branch": "master",
+ "commit": "1ad79313a5c3e6a453fbeb44caac5c5bbad46d3c",
+ "commit_count": 62691
+ },
+ "meta-yp-qa": {
+ "branch": "master",
+ "commit": "faa3165b975b09b0a1445d2cb7a2d4afc173f7c6",
+ "commit_count": 14
+ }
+ },
+ "MACHINE": "genericx86",
+ "STARTTIME": "20210722065114",
+ "TESTSERIES": "minnowboard",
+ "TEST_TYPE": "runtime"
+ },
+ "result": {
+ "apt.AptRepoTest.test_apt_install_from_repo": {
+ "duration": 0.0010154247283935547,
+ "log": "Test requires apt to be installed",
+ "status": "SKIPPED"
+ },
+ "buildcpio.BuildCpioTest.test_cpio": {
+ "duration": 189.3218913078308,
+ "status": "PASSED"
+ },
+ "buildgalculator.GalculatorTest.test_galculator": {
+ "duration": 0.0013816356658935547,
+ "log": "Test requires gtk+3 to be installed",
+ "status": "SKIPPED"
+ },
+ "buildlzip.BuildLzipTest.test_lzip": {
+ "duration": 47.7064368724823,
+ "status": "PASSED"
+ },
+ "connman.ConnmanTest.test_connmand_help": {
+ "duration": 0.2837047576904297,
+ "status": "PASSED"
+ },
+ "connman.ConnmanTest.test_connmand_running": {
+ "duration": 0.2966926097869873,
+ "status": "PASSED"
+ },
+ "date.DateTest.test_date": {
+ "duration": 0.9570956230163574,
+ "status": "PASSED"
+ },
+ "df.DfTest.test_df": {
+ "duration": 0.2593104839324951,
+ "status": "PASSED"
+ },
+ "dnf.DnfBasicTest.test_dnf_help": {
+ "duration": 3.94400691986084,
+ "status": "PASSED"
+ },
+ "dnf.DnfBasicTest.test_dnf_history": {
+ "duration": 4.0761027336120605,
+ "status": "PASSED"
+ },
+ "dnf.DnfBasicTest.test_dnf_info": {
+ "duration": 1.8353967666625977,
+ "status": "PASSED"
+ },
+ "dnf.DnfBasicTest.test_dnf_search": {
+ "duration": 1.7365286350250244,
+ "status": "PASSED"
+ },
+ "dnf.DnfBasicTest.test_dnf_version": {
+ "duration": 1.668027400970459,
+ "status": "PASSED"
+ },
+ "dnf.DnfRepoTest.test_dnf_exclude": {
+ "duration": 51.617703676223755,
+ "status": "PASSED"
+ },
+ "dnf.DnfRepoTest.test_dnf_install": {
+ "duration": 6.5537238121032715,
+ "status": "PASSED"
+ },
+ "dnf.DnfRepoTest.test_dnf_install_dependency": {
+ "duration": 10.356114387512207,
+ "status": "PASSED"
+ },
+ "dnf.DnfRepoTest.test_dnf_install_from_disk": {
+ "duration": 12.189398527145386,
+ "status": "PASSED"
+ },
+ "dnf.DnfRepoTest.test_dnf_install_from_http": {
+ "duration": 10.08981966972351,
+ "status": "PASSED"
+ },
+ "dnf.DnfRepoTest.test_dnf_installroot": {
+ "duration": 32.153626441955566,
+ "status": "PASSED"
+ },
+ "dnf.DnfRepoTest.test_dnf_installroot_usrmerge": {
+ "duration": 0.0009377002716064453,
+ "log": "Test run when enable usrmege",
+ "status": "SKIPPED"
+ },
+ "dnf.DnfRepoTest.test_dnf_makecache": {
+ "duration": 1.8885772228240967,
+ "status": "PASSED"
+ },
+ "dnf.DnfRepoTest.test_dnf_reinstall": {
+ "duration": 4.149793863296509,
+ "status": "PASSED"
+ },
+ "dnf.DnfRepoTest.test_dnf_repoinfo": {
+ "duration": 1.7556416988372803,
+ "status": "PASSED"
+ },
+ "gcc.GccCompileTest.test_gcc_compile": {
+ "duration": 1.87632417678833,
+ "status": "PASSED"
+ },
+ "gcc.GccCompileTest.test_gpp2_compile": {
+ "duration": 1.9646601676940918,
+ "status": "PASSED"
+ },
+ "gcc.GccCompileTest.test_gpp_compile": {
+ "duration": 3.047394037246704,
+ "status": "PASSED"
+ },
+ "gcc.GccCompileTest.test_make": {
+ "duration": 1.5667998790740967,
+ "status": "PASSED"
+ },
+ "gi.GObjectIntrospectionTest.test_python": {
+ "duration": 0.8593721389770508,
+ "status": "PASSED"
+ },
+ "kernelmodule.KernelModuleTest.test_kernel_module": {
+ "duration": 42.535685300827026,
+ "status": "PASSED"
+ },
+ "ldd.LddTest.test_ldd": {
+ "duration": 0.7282640933990479,
+ "status": "PASSED"
+ },
+ "logrotate.LogrotateTest.test_logrotate_newlog": {
+ "duration": 1.455122709274292,
+ "status": "PASSED"
+ },
+ "logrotate.LogrotateTest.test_logrotate_wtmp": {
+ "duration": 1.259333848953247,
+ "status": "PASSED"
+ },
+ "oe_syslog.SyslogTest.test_syslog_running": {
+ "duration": 0.2721266746520996,
+ "status": "PASSED"
+ },
+ "oe_syslog.SyslogTestConfig.test_syslog_logger": {
+ "duration": 1.4760699272155762,
+ "status": "PASSED"
+ },
+ "oe_syslog.SyslogTestConfig.test_syslog_restart": {
+ "duration": 2.5969552993774414,
+ "status": "PASSED"
+ },
+ "oe_syslog.SyslogTestConfig.test_syslog_startup_config": {
+ "duration": 5.720225811004639,
+ "status": "PASSED"
+ },
+ "opengl.GraphicTest.test_graphic_opengl_with_glxgears": {
+ "duration": 2.5626444816589355,
+ "status": "PASSED"
+ },
+ "opkg.OpkgRepoTest.test_opkg_install_from_repo": {
+ "duration": 0.0007810592651367188,
+ "log": "Test requires opkg to be installed",
+ "status": "SKIPPED"
+ },
+ "pam.PamBasicTest.test_pam": {
+ "duration": 0.0009965896606445312,
+ "log": "Test requires pam to be in DISTRO_FEATURES",
+ "status": "SKIPPED"
+ },
+ "parselogs.ParseLogsTest.test_parselogs": {
+ "duration": 4.59806489944458,
+ "log": "Traceback (most recent call last):\n File \"/home/pokybuild/yocto-autobuilder-new/yocto-worker/E2E-genericx86-linux-yocto/build/meta/lib/oeqa/core/decorator/__init__.py\", line 36, in wrapped_f\n return func(*args, **kwargs)\n File \"/home/pokybuild/yocto-autobuilder-new/yocto-worker/E2E-genericx86-linux-yocto/build/meta/lib/oeqa/runtime/cases/parselogs.py\", line 383, in test_parselogs\n self.assertEqual(errcount, 0, msg=self.msg)\nAssertionError: 6 != 0 : Log: /home/pokybuild/yocto-autobuilder-new/yocto-worker/E2E-genericx86-linux-yocto/build/build/tmp-minnowboard/work/genericx86-poky-linux/core-image-sato-sdk/1.0-r0/target_logs/dmesg\n-----------------------\nCentral error: [ 5.751243] i915 0000:00:02.0: [drm] Cannot find any crtc or sizes\n***********************\n[ 5.026249] udevd[149]: starting eudev-3.2.10\n[ 5.268839] i915 0000:00:02.0: vgaarb: deactivate vga console\n[ 5.275652] i915 0000:00:02.0: vgaarb: changed VGA decodes: olddecodes=io+mem,decodes=io+mem:owns=io+mem\n[ 5.328381] [drm] Initialized i915 1.6.0 20200917 for 0000:00:02.0 on minor 0\n[ 5.371959] ACPI: Video Device [GFX0] (multi-head: yes rom: no post: no)\n[ 5.379794] acpi device:30: registered as cooling_device2\n[ 5.389633] input: Video Bus as /devices/LNXSYSTM:00/LNXSYBUS:00/PNP0A08:00/LNXVIDEO:00/input/input3\n[ 5.400770] snd_hda_intel 0000:00:1b.0: bound 0000:00:02.0 (ops i915_audio_component_bind_ops [i915])\n[ 5.532817] random: crng init done\n[ 5.535199] random: 4 urandom warning(s) missed due to ratelimiting\n[ 5.751243] i915 0000:00:02.0: [drm] Cannot find any crtc or sizes\n[ 5.844757] input: HDA Intel PCH HDMI/DP,pcm=3 as /devices/pci0000:00/0000:00:1b.0/sound/card0/input4\n[ 5.868525] input: HDA Intel PCH HDMI/DP,pcm=7 as /devices/pci0000:00/0000:00:1b.0/sound/card0/input5\n[ 6.051608] i915 0000:00:02.0: [drm] Cannot find any crtc or sizes\n[ 6.167197] FAT-fs (mmcblk1p1): Volume was not properly unmounted. Some data may be corrupt. Please run fsck.\n[ 6.532584] i915 0000:00:02.0: [drm] Cannot find any crtc or sizes\n[ 19.753245] EXT4-fs (mmcblk1p2): recovery complete\n[ 19.766017] EXT4-fs (mmcblk1p2): mounted filesystem with ordered data mode. Opts: (null)\n[ 19.873295] EXT4-fs (sda2): re-mounted. Opts: (null)\n\n***********************\nCentral error: [ 6.051608] i915 0000:00:02.0: [drm] Cannot find any crtc or sizes\n***********************\n[ 5.328381] [drm] Initialized i915 1.6.0 20200917 for 0000:00:02.0 on minor 0\n[ 5.371959] ACPI: Video Device [GFX0] (multi-head: yes rom: no post: no)\n[ 5.379794] acpi device:30: registered as cooling_device2\n[ 5.389633] input: Video Bus as /devices/LNXSYSTM:00/LNXSYBUS:00/PNP0A08:00/LNXVIDEO:00/input/input3\n[ 5.400770] snd_hda_intel 0000:00:1b.0: bound 0000:00:02.0 (ops i915_audio_component_bind_ops [i915])\n[ 5.532817] random: crng init done\n[ 5.535199] random: 4 urandom warning(s) missed due to ratelimiting\n[ 5.751243] i915 0000:00:02.0: [drm] Cannot find any crtc or sizes\n[ 5.844757] input: HDA Intel PCH HDMI/DP,pcm=3 as /devices/pci0000:00/0000:00:1b.0/sound/card0/input4\n[ 5.868525] input: HDA Intel PCH HDMI/DP,pcm=7 as /devices/pci0000:00/0000:00:1b.0/sound/card0/input5\n[ 6.051608] i915 0000:00:02.0: [drm] Cannot find any crtc or sizes\n[ 6.167197] FAT-fs (mmcblk1p1): Volume was not properly unmounted. Some data may be corrupt. Please run fsck.\n[ 6.532584] i915 0000:00:02.0: [drm] Cannot find any crtc or sizes\n[ 19.753245] EXT4-fs (mmcblk1p2): recovery complete\n[ 19.766017] EXT4-fs (mmcblk1p2): mounted filesystem with ordered data mode. Opts: (null)\n[ 19.873295] EXT4-fs (sda2): re-mounted. Opts: (null)\n\n***********************\nCentral error: [ 6.532584] i915 0000:00:02.0: [drm] Cannot find any crtc or sizes\n***********************\n[ 5.379794] acpi device:30: registered as cooling_device2\n[ 5.389633] input: Video Bus as /devices/LNXSYSTM:00/LNXSYBUS:00/PNP0A08:00/LNXVIDEO:00/input/input3\n[ 5.400770] snd_hda_intel 0000:00:1b.0: bound 0000:00:02.0 (ops i915_audio_component_bind_ops [i915])\n[ 5.532817] random: crng init done\n[ 5.535199] random: 4 urandom warning(s) missed due to ratelimiting\n[ 5.751243] i915 0000:00:02.0: [drm] Cannot find any crtc or sizes\n[ 5.844757] input: HDA Intel PCH HDMI/DP,pcm=3 as /devices/pci0000:00/0000:00:1b.0/sound/card0/input4\n[ 5.868525] input: HDA Intel PCH HDMI/DP,pcm=7 as /devices/pci0000:00/0000:00:1b.0/sound/card0/input5\n[ 6.051608] i915 0000:00:02.0: [drm] Cannot find any crtc or sizes\n[ 6.167197] FAT-fs (mmcblk1p1): Volume was not properly unmounted. Some data may be corrupt. Please run fsck.\n[ 6.532584] i915 0000:00:02.0: [drm] Cannot find any crtc or sizes\n[ 19.753245] EXT4-fs (mmcblk1p2): recovery complete\n[ 19.766017] EXT4-fs (mmcblk1p2): mounted filesystem with ordered data mode. Opts: (null)\n[ 19.873295] EXT4-fs (sda2): re-mounted. Opts: (null)\n\n***********************\nLog: /home/pokybuild/yocto-autobuilder-new/yocto-worker/E2E-genericx86-linux-yocto/build/build/tmp-minnowboard/work/genericx86-poky-linux/core-image-sato-sdk/1.0-r0/target_logs/dmesg_output.log\n-----------------------\nCentral error: [ 5.751243] i915 0000:00:02.0: [drm] Cannot find any crtc or sizes\n***********************\n[ 5.026249] udevd[149]: starting eudev-3.2.10\n[ 5.268839] i915 0000:00:02.0: vgaarb: deactivate vga console\n[ 5.275652] i915 0000:00:02.0: vgaarb: changed VGA decodes: olddecodes=io+mem,decodes=io+mem:owns=io+mem\n[ 5.328381] [drm] Initialized i915 1.6.0 20200917 for 0000:00:02.0 on minor 0\n[ 5.371959] ACPI: Video Device [GFX0] (multi-head: yes rom: no post: no)\n[ 5.379794] acpi device:30: registered as cooling_device2\n[ 5.389633] input: Video Bus as /devices/LNXSYSTM:00/LNXSYBUS:00/PNP0A08:00/LNXVIDEO:00/input/input3\n[ 5.400770] snd_hda_intel 0000:00:1b.0: bound 0000:00:02.0 (ops i915_audio_component_bind_ops [i915])\n[ 5.532817] random: crng init done\n[ 5.535199] random: 4 urandom warning(s) missed due to ratelimiting\n[ 5.751243] i915 0000:00:02.0: [drm] Cannot find any crtc or sizes\n[ 5.844757] input: HDA Intel PCH HDMI/DP,pcm=3 as /devices/pci0000:00/0000:00:1b.0/sound/card0/input4\n[ 5.868525] input: HDA Intel PCH HDMI/DP,pcm=7 as /devices/pci0000:00/0000:00:1b.0/sound/card0/input5\n[ 6.051608] i915 0000:00:02.0: [drm] Cannot find any crtc or sizes\n[ 6.167197] FAT-fs (mmcblk1p1): Volume was not properly unmounted. Some data may be corrupt. Please run fsck.\n[ 6.532584] i915 0000:00:02.0: [drm] Cannot find any crtc or sizes\n[ 19.753245] EXT4-fs (mmcblk1p2): recovery complete\n[ 19.766017] EXT4-fs (mmcblk1p2): mounted filesystem with ordered data mode. Opts: (null)\n[ 19.873295] EXT4-fs (sda2): re-mounted. Opts: (null)\n[ 24.746992] igb 0000:02:00.0 eth0: igb: eth0 NIC Link is Up 1000 Mbps Full Duplex, Flow Control: RX\n[ 24.765710] IPv6: ADDRCONF(NETDEV_CHANGE): eth0: link becomes ready\n\n***********************\nCentral error: [ 6.051608] i915 0000:00:02.0: [drm] Cannot find any crtc or sizes\n***********************\n[ 5.328381] [drm] Initialized i915 1.6.0 20200917 for 0000:00:02.0 on minor 0\n[ 5.371959] ACPI: Video Device [GFX0] (multi-head: yes rom: no post: no)\n[ 5.379794] acpi device:30: registered as cooling_device2\n[ 5.389633] input: Video Bus as /devices/LNXSYSTM:00/LNXSYBUS:00/PNP0A08:00/LNXVIDEO:00/input/input3\n[ 5.400770] snd_hda_intel 0000:00:1b.0: bound 0000:00:02.0 (ops i915_audio_component_bind_ops [i915])\n[ 5.532817] random: crng init done\n[ 5.535199] random: 4 urandom warning(s) missed due to ratelimiting\n[ 5.751243] i915 0000:00:02.0: [drm] Cannot find any crtc or sizes\n[ 5.844757] input: HDA Intel PCH HDMI/DP,pcm=3 as /devices/pci0000:00/0000:00:1b.0/sound/card0/input4\n[ 5.868525] input: HDA Intel PCH HDMI/DP,pcm=7 as /devices/pci0000:00/0000:00:1b.0/sound/card0/input5\n[ 6.051608] i915 0000:00:02.0: [drm] Cannot find any crtc or sizes\n[ 6.167197] FAT-fs (mmcblk1p1): Volume was not properly unmounted. Some data may be corrupt. Please run fsck.\n[ 6.532584] i915 0000:00:02.0: [drm] Cannot find any crtc or sizes\n[ 19.753245] EXT4-fs (mmcblk1p2): recovery complete\n[ 19.766017] EXT4-fs (mmcblk1p2): mounted filesystem with ordered data mode. Opts: (null)\n[ 19.873295] EXT4-fs (sda2): re-mounted. Opts: (null)\n[ 24.746992] igb 0000:02:00.0 eth0: igb: eth0 NIC Link is Up 1000 Mbps Full Duplex, Flow Control: RX\n[ 24.765710] IPv6: ADDRCONF(NETDEV_CHANGE): eth0: link becomes ready\n[ 24.797144] 8021q: 802.1Q VLAN Support v1.8\n[ 24.800413] 8021q: adding VLAN 0 to HW filter on device eth0\n[ 24.811457] 8021q: adding VLAN 0 to HW filter on device eth1\n\n***********************\nCentral error: [ 6.532584] i915 0000:00:02.0: [drm] Cannot find any crtc or sizes\n***********************\n[ 5.379794] acpi device:30: registered as cooling_device2\n[ 5.389633] input: Video Bus as /devices/LNXSYSTM:00/LNXSYBUS:00/PNP0A08:00/LNXVIDEO:00/input/input3\n[ 5.400770] snd_hda_intel 0000:00:1b.0: bound 0000:00:02.0 (ops i915_audio_component_bind_ops [i915])\n[ 5.532817] random: crng init done\n[ 5.535199] random: 4 urandom warning(s) missed due to ratelimiting\n[ 5.751243] i915 0000:00:02.0: [drm] Cannot find any crtc or sizes\n[ 5.844757] input: HDA Intel PCH HDMI/DP,pcm=3 as /devices/pci0000:00/0000:00:1b.0/sound/card0/input4\n[ 5.868525] input: HDA Intel PCH HDMI/DP,pcm=7 as /devices/pci0000:00/0000:00:1b.0/sound/card0/input5\n[ 6.051608] i915 0000:00:02.0: [drm] Cannot find any crtc or sizes\n[ 6.167197] FAT-fs (mmcblk1p1): Volume was not properly unmounted. Some data may be corrupt. Please run fsck.\n[ 6.532584] i915 0000:00:02.0: [drm] Cannot find any crtc or sizes\n[ 19.753245] EXT4-fs (mmcblk1p2): recovery complete\n[ 19.766017] EXT4-fs (mmcblk1p2): mounted filesystem with ordered data mode. Opts: (null)\n[ 19.873295] EXT4-fs (sda2): re-mounted. Opts: (null)\n[ 24.746992] igb 0000:02:00.0 eth0: igb: eth0 NIC Link is Up 1000 Mbps Full Duplex, Flow Control: RX\n[ 24.765710] IPv6: ADDRCONF(NETDEV_CHANGE): eth0: link becomes ready\n[ 24.797144] 8021q: 802.1Q VLAN Support v1.8\n[ 24.800413] 8021q: adding VLAN 0 to HW filter on device eth0\n[ 24.811457] 8021q: adding VLAN 0 to HW filter on device eth1\n[ 30.704780] Bluetooth: BNEP (Ethernet Emulation) ver 1.3\n[ 30.709332] Bluetooth: BNEP filters: protocol multicast\n\n***********************\n6 errors found in logs.\n\nStdout:\nMachine information: \n*******************************\nMachine name: genericx86\nCPU: Intel(R) Atom(TM) CPU E3826 @ 1.46GHz\nArch: i686\nPhysical cores: 2\nLogical cores: 2\n*******************************\n\n",
+ "status": "FAILED"
+ },
+ "perl.PerlTest.test_perl_works": {
+ "duration": 0.24773836135864258,
+ "status": "PASSED"
+ },
+ "ping.PingTest.test_ping": {
+ "duration": 0.06865501403808594,
+ "status": "PASSED"
+ },
+ "python.PythonTest.test_python3": {
+ "duration": 0.4476191997528076,
+ "status": "PASSED"
+ },
+ "rpm.RpmBasicTest.test_rpm_help": {
+ "duration": 0.34678196907043457,
+ "status": "PASSED"
+ },
+ "rpm.RpmBasicTest.test_rpm_query": {
+ "duration": 0.553809404373169,
+ "status": "PASSED"
+ },
+ "rpm.RpmBasicTest.test_rpm_query_nonroot": {
+ "duration": 3.233064651489258,
+ "status": "PASSED"
+ },
+ "rpm.RpmInstallRemoveTest.test_check_rpm_install_removal_log_file_size": {
+ "duration": 25.706159353256226,
+ "status": "PASSED"
+ },
+ "rpm.RpmInstallRemoveTest.test_rpm_install": {
+ "duration": 2.2924578189849854,
+ "status": "PASSED"
+ },
+ "rpm.RpmInstallRemoveTest.test_rpm_remove": {
+ "duration": 1.04536771774292,
+ "status": "PASSED"
+ },
+ "rpmextra.RpmExtraTest.test_rpm_install_dependency": {
+ "duration": 6.172695159912109,
+ "status": "PASSED"
+ },
+ "scp.ScpTest.test_scp_file": {
+ "duration": 0.8430333137512207,
+ "status": "PASSED"
+ },
+ "ssh.SSHTest.test_ssh": {
+ "duration": 0.6192982196807861,
+ "status": "PASSED"
+ },
+ "stap.StapTest.test_stap": {
+ "duration": 71.40876293182373,
+ "log": "Traceback (most recent call last):\n File \"/home/pokybuild/yocto-autobuilder-new/yocto-worker/E2E-genericx86-linux-yocto/build/meta/lib/oeqa/core/decorator/__init__.py\", line 36, in wrapped_f\n return func(*args, **kwargs)\n File \"/home/pokybuild/yocto-autobuilder-new/yocto-worker/E2E-genericx86-linux-yocto/build/meta/lib/oeqa/core/decorator/__init__.py\", line 36, in wrapped_f\n return func(*args, **kwargs)\n File \"/home/pokybuild/yocto-autobuilder-new/yocto-worker/E2E-genericx86-linux-yocto/build/meta/lib/oeqa/core/decorator/__init__.py\", line 36, in wrapped_f\n return func(*args, **kwargs)\n File \"/home/pokybuild/yocto-autobuilder-new/yocto-worker/E2E-genericx86-linux-yocto/build/meta/lib/oeqa/runtime/cases/stap.py\", line 37, in test_stap\n self.assertEqual(status, 0, msg='\\n'.join([cmd, output]))\nAssertionError: 1 != 0 : stap --disable-cache -DSTP_NO_VERREL_CHECK /tmp/hello.stp\nWARNING: Kernel function symbol table missing [man warning::symbols]\nIn file included from /usr/share/systemtap/runtime/linux/../regs.c:20,\n from /usr/share/systemtap/runtime/linux/runtime.h:251,\n from /usr/share/systemtap/runtime/runtime.h:26,\n from /tmp/stapaWVl5g/stap_20813_src.c:21:\n/usr/share/systemtap/runtime/linux/../linux/regs.c: In function '_stp_print_regs':\n/usr/share/systemtap/runtime/linux/../linux/regs.c:97:33: error: 'struct pt_regs' has no member named 'eip'; did you mean 'ip'?\n 97 | #define EREG(nm, regs) ((regs)->e##nm)\n | ^\n/usr/share/systemtap/runtime/linux/../linux/regs.c:109:38: note: in expansion of macro 'EREG'\n 109 | _stp_printf (\"EIP: %08lx\\n\", EREG(ip, regs));\n | ^~~~\n/usr/share/systemtap/runtime/linux/../linux/regs.c:97:33: error: 'struct pt_regs' has no member named 'esp'; did you mean 'es'?\n 97 | #define EREG(nm, regs) ((regs)->e##nm)\n | ^\n/usr/share/systemtap/runtime/linux/../linux/regs.c:110:38: note: in expansion of macro 'EREG'\n 110 | _stp_printf (\"ESP: %08lx\\n\", EREG(sp, regs));\n | ^~~~\n/usr/share/systemtap/runtime/linux/../linux/regs.c:97:33: error: 'struct pt_regs' has no member named 'eax'; did you mean 'ax'?\n 97 | #define EREG(nm, regs) ((regs)->e##nm)\n | ^\n/usr/share/systemtap/runtime/linux/../linux/regs.c:112:25: note: in expansion of macro 'EREG'\n 112 | EREG(ax, regs), EREG(bx, regs), EREG(cx, regs), EREG(dx, regs));\n | ^~~~\n/usr/share/systemtap/runtime/linux/../linux/regs.c:97:33: error: 'struct pt_regs' has no member named 'ebx'; did you mean 'bx'?\n 97 | #define EREG(nm, regs) ((regs)->e##nm)\n | ^\n/usr/share/systemtap/runtime/linux/../linux/regs.c:112:41: note: in expansion of macro 'EREG'\n 112 | EREG(ax, regs), EREG(bx, regs), EREG(cx, regs), EREG(dx, regs));\n | ^~~~\n/usr/share/systemtap/runtime/linux/../linux/regs.c:97:33: error: 'struct pt_regs' has no member named 'ecx'; did you mean 'cx'?\n 97 | #define EREG(nm, regs) ((regs)->e##nm)\n | ^\n/usr/share/systemtap/runtime/linux/../linux/regs.c:112:57: note: in expansion of macro 'EREG'\n 112 | EREG(ax, regs), EREG(bx, regs), EREG(cx, regs), EREG(dx, regs));\n | ^~~~\n/usr/share/systemtap/runtime/linux/../linux/regs.c:97:33: error: 'struct pt_regs' has no member named 'edx'; did you mean 'dx'?\n 97 | #define EREG(nm, regs) ((regs)->e##nm)\n | ^\n/usr/share/systemtap/runtime/linux/../linux/regs.c:112:73: note: in expansion of macro 'EREG'\n 112 | EREG(ax, regs), EREG(bx, regs), EREG(cx, regs), EREG(dx, regs));\n | ^~~~\n/usr/share/systemtap/runtime/linux/../linux/regs.c:97:33: error: 'struct pt_regs' has no member named 'esi'; did you mean 'si'?\n 97 | #define EREG(nm, regs) ((regs)->e##nm)\n | ^\n/usr/share/systemtap/runtime/linux/../linux/regs.c:114:25: note: in expansion of macro 'EREG'\n 114 | EREG(si, regs), EREG(di, regs), EREG(bp, regs));\n | ^~~~\n/usr/share/systemtap/runtime/linux/../linux/regs.c:97:33: error: 'struct pt_regs' has no member named 'edi'; did you mean 'di'?\n 97 | #define EREG(nm, regs) ((regs)->e##nm)\n | ^\n/usr/share/systemtap/runtime/linux/../linux/regs.c:114:41: note: in expansion of macro 'EREG'\n 114 | EREG(si, regs), EREG(di, regs), EREG(bp, regs));\n | ^~~~\n/usr/share/systemtap/runtime/linux/../linux/regs.c:97:33: error: 'struct pt_regs' has no member named 'ebp'; did you mean 'bp'?\n 97 | #define EREG(nm, regs) ((regs)->e##nm)\n | ^\n/usr/share/systemtap/runtime/linux/../linux/regs.c:114:57: note: in expansion of macro 'EREG'\n 114 | EREG(si, regs), EREG(di, regs), EREG(bp, regs));\n | ^~~~\n/usr/share/systemtap/runtime/linux/../linux/regs.c:98:33: error: 'struct pt_regs' has no member named 'xds'; did you mean 'ds'?\n 98 | #define XREG(nm, regs) ((regs)->x##nm)\n | ^\n/usr/share/systemtap/runtime/linux/../linux/regs.c:116:34: note: in expansion of macro 'XREG'\n 116 | 0xffff & XREG(ds, regs), 0xffff & XREG(es, regs));\n | ^~~~\n/usr/share/systemtap/runtime/linux/../linux/regs.c:98:33: error: 'struct pt_regs' has no member named 'xes'; did you mean 'es'?\n 98 | #define XREG(nm, regs) ((regs)->x##nm)\n | ^\n/usr/share/systemtap/runtime/linux/../linux/regs.c:116:59: note: in expansion of macro 'XREG'\n 116 | 0xffff & XREG(ds, regs), 0xffff & XREG(es, regs));\n | ^~~~\n/usr/share/systemtap/runtime/linux/../regs.c: In function '_stp_get_sp':\n/usr/share/systemtap/runtime/linux/../linux/regs.c:97:33: error: 'struct pt_regs' has no member named 'esp'; did you mean 'es'?\n 97 | #define EREG(nm, regs) ((regs)->e##nm)\n | ^\n/usr/share/systemtap/runtime/linux/../regs.c:47:32: note: in expansion of macro 'EREG'\n 47 | return (long) &EREG(sp, regs);\n | ^~~~\n/usr/share/systemtap/runtime/linux/../linux/regs.c:97:33: error: 'struct pt_regs' has no member named 'esp'; did you mean 'es'?\n 97 | #define EREG(nm, regs) ((regs)->e##nm)\n | ^\n/usr/share/systemtap/runtime/linux/../regs.c:48:16: note: in expansion of macro 'EREG'\n 48 | return EREG(sp, regs);\n | ^~~~\n/usr/share/systemtap/runtime/linux/../regs.c: In function '_stp_get_arg32_by_number':\n/usr/share/systemtap/runtime/linux/../linux/regs.c:97:33: error: 'struct pt_regs' has no member named 'eax'; did you mean 'ax'?\n 97 | #define EREG(nm, regs) ((regs)->e##nm)\n | ^\n/usr/share/systemtap/runtime/linux/../regs.c:102:25: note: in expansion of macro 'EREG'\n 102 | #define ERREG(nm, regs) EREG(nm, regs)\n | ^~~~\n/usr/share/systemtap/runtime/linux/../regs.c:123:42: note: in expansion of macro 'ERREG'\n 123 | case 1: *val = (int32_t)(ERREG(ax, regs)); break;\n | ^~~~~\n/usr/share/systemtap/runtime/linux/../linux/regs.c:97:33: error: 'struct pt_regs' has no member named 'edx'; did you mean 'dx'?\n 97 | #define EREG(nm, regs) ((regs)->e##nm)\n | ^\n/usr/share/systemtap/runtime/linux/../regs.c:102:25: note: in expansion of macro 'EREG'\n 102 | #define ERREG(nm, regs) EREG(nm, regs)\n | ^~~~\n/usr/share/systemtap/runtime/linux/../regs.c:124:42: note: in expansion of macro 'ERREG'\n 124 | case 2: *val = (int32_t)(ERREG(dx, regs)); break;\n | ^~~~~\n/usr/share/systemtap/runtime/linux/../linux/regs.c:97:33: error: 'struct pt_regs' has no member named 'ecx'; did you mean 'cx'?\n 97 | #define EREG(nm, regs) ((regs)->e##nm)\n | ^\n/usr/share/systemtap/runtime/linux/../regs.c:102:25: note: in expansion of macro 'EREG'\n 102 | #define ERREG(nm, regs) EREG(nm, regs)\n | ^~~~\n/usr/share/systemtap/runtime/linux/../regs.c:125:42: note: in expansion of macro 'ERREG'\n 125 | case 3: *val = (int32_t)(ERREG(cx, regs)); break;\n | ^~~~~\nmake[1]: *** [scripts/Makefile.build:279: /tmp/stapaWVl5g/stap_20813_src.o] Error 1\nmake: *** [Makefile:1821: /tmp/stapaWVl5g] Error 2\nWARNING: kbuild exited with status: 2\nPass 4: compilation failed. [man error::pass4]\n",
+ "status": "FAILED"
+ },
+ "systemd.SystemdBasicTests.test_systemd_basic": {
+ "duration": 0.0007877349853515625,
+ "log": "systemd is not the init manager for this image",
+ "status": "SKIPPED"
+ },
+ "systemd.SystemdBasicTests.test_systemd_failed": {
+ "duration": 0.0006158351898193359,
+ "log": "Test case systemd.SystemdBasicTests.test_systemd_failed depends on systemd.SystemdBasicTests.test_systemd_basic but it didn't pass/run.",
+ "status": "SKIPPED"
+ },
+ "systemd.SystemdBasicTests.test_systemd_list": {
+ "duration": 0.0004951953887939453,
+ "log": "Test case systemd.SystemdBasicTests.test_systemd_list depends on systemd.SystemdBasicTests.test_systemd_basic but it didn't pass/run.",
+ "status": "SKIPPED"
+ },
+ "systemd.SystemdJournalTests.test_systemd_boot_time": {
+ "duration": 0.0005526542663574219,
+ "log": "Test case systemd.SystemdJournalTests.test_systemd_boot_time depends on systemd.SystemdBasicTests.test_systemd_basic but it didn't pass/run.",
+ "status": "SKIPPED"
+ },
+ "systemd.SystemdJournalTests.test_systemd_journal": {
+ "duration": 0.0005030632019042969,
+ "log": "Test case systemd.SystemdJournalTests.test_systemd_journal depends on systemd.SystemdBasicTests.test_systemd_basic but it didn't pass/run.",
+ "status": "SKIPPED"
+ },
+ "systemd.SystemdServiceTests.test_systemd_disable_enable": {
+ "duration": 0.0006871223449707031,
+ "log": "Test case systemd.SystemdServiceTests.test_systemd_disable_enable depends on systemd.SystemdServiceTests.test_systemd_status but it didn't pass/run.",
+ "status": "SKIPPED"
+ },
+ "systemd.SystemdServiceTests.test_systemd_disable_enable_ro": {
+ "duration": 0.0005464553833007812,
+ "log": "Test is only meant to run with read-only-rootfs in IMAGE_FEATURES",
+ "status": "SKIPPED"
+ },
+ "systemd.SystemdServiceTests.test_systemd_status": {
+ "duration": 0.0005133152008056641,
+ "log": "Test case systemd.SystemdServiceTests.test_systemd_status depends on systemd.SystemdBasicTests.test_systemd_basic but it didn't pass/run.",
+ "status": "SKIPPED"
+ },
+ "systemd.SystemdServiceTests.test_systemd_stop_start": {
+ "duration": 0.0005166530609130859,
+ "log": "Test case systemd.SystemdServiceTests.test_systemd_stop_start depends on systemd.SystemdServiceTests.test_systemd_status but it didn't pass/run.",
+ "status": "SKIPPED"
+ },
+ "weston.WestonTest.test_wayland_info": {
+ "duration": 0.0006163120269775391,
+ "log": "Test requires wayland-utils to be installed",
+ "status": "SKIPPED"
+ },
+ "weston.WestonTest.test_weston_can_initialize_new_wayland_compositor": {
+ "duration": 0.000553131103515625,
+ "log": "Test requires weston to be installed",
+ "status": "SKIPPED"
+ },
+ "weston.WestonTest.test_weston_running": {
+ "duration": 0.0005624294281005859,
+ "log": "Test requires weston to be installed",
+ "status": "SKIPPED"
+ },
+ "xorg.XorgTest.test_xorg_running": {
+ "duration": 0.5797741413116455,
+ "status": "PASSED"
+ }
+ }
+ }
+} \ No newline at end of file