aboutsummaryrefslogtreecommitdiffstats
path: root/3.3.3_RC2/3.3.3_RC2_test_results/nuc6
diff options
context:
space:
mode:
Diffstat (limited to '3.3.3_RC2/3.3.3_RC2_test_results/nuc6')
-rw-r--r--3.3.3_RC2/3.3.3_RC2_test_results/nuc6/testresults.json326
1 files changed, 326 insertions, 0 deletions
diff --git a/3.3.3_RC2/3.3.3_RC2_test_results/nuc6/testresults.json b/3.3.3_RC2/3.3.3_RC2_test_results/nuc6/testresults.json
new file mode 100644
index 0000000..b84669a
--- /dev/null
+++ b/3.3.3_RC2/3.3.3_RC2_test_results/nuc6/testresults.json
@@ -0,0 +1,326 @@
+{
+ "runtime_core-image-sato-sdk_genericx86-64_20210910091549": {
+ "configuration": {
+ "DISTRO": "poky",
+ "HOST_DISTRO": "ubuntu-18.04",
+ "IMAGE_BASENAME": "core-image-sato-sdk",
+ "IMAGE_PKGTYPE": "rpm",
+ "LAYERS": {
+ "meta": {
+ "branch": "hardknott",
+ "commit": "0a2ca9d60f3851515a79d5aa9ddd8b4069b5a206",
+ "commit_count": 61977
+ },
+ "meta-intel": {
+ "branch": "hardknott",
+ "commit": "5c4a6b02f650a99a5ec55561443fcf880a863d19",
+ "commit_count": 2555
+ },
+ "meta-poky": {
+ "branch": "hardknott",
+ "commit": "0a2ca9d60f3851515a79d5aa9ddd8b4069b5a206",
+ "commit_count": 61977
+ },
+ "meta-yocto-bsp": {
+ "branch": "hardknott",
+ "commit": "0a2ca9d60f3851515a79d5aa9ddd8b4069b5a206",
+ "commit_count": 61977
+ },
+ "meta-yp-qa": {
+ "branch": "master",
+ "commit": "6c349fbbee365016502b05632891631e4ca53bd1",
+ "commit_count": 16
+ }
+ },
+ "MACHINE": "genericx86-64",
+ "STARTTIME": "20210910091549",
+ "TESTSERIES": "skylake",
+ "TEST_TYPE": "runtime"
+ },
+ "result": {
+ "apt.AptRepoTest.test_apt_install_from_repo": {
+ "duration": 0.0008974075317382812,
+ "log": "Test requires apt to be installed",
+ "status": "SKIPPED"
+ },
+ "buildcpio.BuildCpioTest.test_cpio": {
+ "duration": 30.695865631103516,
+ "status": "PASSED"
+ },
+ "buildgalculator.GalculatorTest.test_galculator": {
+ "duration": 0.0013630390167236328,
+ "log": "Test requires gtk+3 to be installed",
+ "status": "SKIPPED"
+ },
+ "buildlzip.BuildLzipTest.test_lzip": {
+ "duration": 5.285211563110352,
+ "status": "PASSED"
+ },
+ "connman.ConnmanTest.test_connmand_help": {
+ "duration": 0.1673135757446289,
+ "status": "PASSED"
+ },
+ "connman.ConnmanTest.test_connmand_running": {
+ "duration": 0.11446547508239746,
+ "status": "PASSED"
+ },
+ "date.DateTest.test_date": {
+ "duration": 0.4967782497406006,
+ "status": "PASSED"
+ },
+ "df.DfTest.test_df": {
+ "duration": 0.11818504333496094,
+ "status": "PASSED"
+ },
+ "dnf.DnfBasicTest.test_dnf_help": {
+ "duration": 0.581629753112793,
+ "status": "PASSED"
+ },
+ "dnf.DnfBasicTest.test_dnf_history": {
+ "duration": 0.717879056930542,
+ "status": "PASSED"
+ },
+ "dnf.DnfBasicTest.test_dnf_info": {
+ "duration": 0.3033711910247803,
+ "status": "PASSED"
+ },
+ "dnf.DnfBasicTest.test_dnf_search": {
+ "duration": 0.28896164894104004,
+ "status": "PASSED"
+ },
+ "dnf.DnfBasicTest.test_dnf_version": {
+ "duration": 0.32441067695617676,
+ "status": "PASSED"
+ },
+ "dnf.DnfRepoTest.test_dnf_exclude": {
+ "duration": 5.843868255615234,
+ "status": "PASSED"
+ },
+ "dnf.DnfRepoTest.test_dnf_install": {
+ "duration": 1.2815921306610107,
+ "status": "PASSED"
+ },
+ "dnf.DnfRepoTest.test_dnf_install_dependency": {
+ "duration": 1.3788797855377197,
+ "status": "PASSED"
+ },
+ "dnf.DnfRepoTest.test_dnf_install_from_disk": {
+ "duration": 1.8546369075775146,
+ "status": "PASSED"
+ },
+ "dnf.DnfRepoTest.test_dnf_install_from_http": {
+ "duration": 1.4009919166564941,
+ "status": "PASSED"
+ },
+ "dnf.DnfRepoTest.test_dnf_installroot": {
+ "duration": 11.560979127883911,
+ "status": "PASSED"
+ },
+ "dnf.DnfRepoTest.test_dnf_installroot_usrmerge": {
+ "duration": 0.0009174346923828125,
+ "log": "Test run when enable usrmege",
+ "status": "SKIPPED"
+ },
+ "dnf.DnfRepoTest.test_dnf_makecache": {
+ "duration": 0.3983800411224365,
+ "status": "PASSED"
+ },
+ "dnf.DnfRepoTest.test_dnf_reinstall": {
+ "duration": 0.45613694190979004,
+ "status": "PASSED"
+ },
+ "dnf.DnfRepoTest.test_dnf_repoinfo": {
+ "duration": 0.29172182083129883,
+ "status": "PASSED"
+ },
+ "gcc.GccCompileTest.test_gcc_compile": {
+ "duration": 0.8018896579742432,
+ "status": "PASSED"
+ },
+ "gcc.GccCompileTest.test_gpp2_compile": {
+ "duration": 0.8114097118377686,
+ "status": "PASSED"
+ },
+ "gcc.GccCompileTest.test_gpp_compile": {
+ "duration": 0.8600037097930908,
+ "status": "PASSED"
+ },
+ "gcc.GccCompileTest.test_make": {
+ "duration": 0.6795542240142822,
+ "status": "PASSED"
+ },
+ "gi.GObjectIntrospectionTest.test_python": {
+ "duration": 0.236708402633667,
+ "status": "PASSED"
+ },
+ "kernelmodule.KernelModuleTest.test_kernel_module": {
+ "duration": 12.065707683563232,
+ "status": "PASSED"
+ },
+ "ldd.LddTest.test_ldd": {
+ "duration": 0.34305596351623535,
+ "status": "PASSED"
+ },
+ "logrotate.LogrotateTest.test_logrotate_newlog": {
+ "duration": 0.7078220844268799,
+ "status": "PASSED"
+ },
+ "logrotate.LogrotateTest.test_logrotate_wtmp": {
+ "duration": 0.5448498725891113,
+ "status": "PASSED"
+ },
+ "oe_syslog.SyslogTest.test_syslog_running": {
+ "duration": 0.1618959903717041,
+ "status": "PASSED"
+ },
+ "oe_syslog.SyslogTestConfig.test_syslog_logger": {
+ "duration": 1.2019898891448975,
+ "status": "PASSED"
+ },
+ "oe_syslog.SyslogTestConfig.test_syslog_restart": {
+ "duration": 1.1456222534179688,
+ "status": "PASSED"
+ },
+ "oe_syslog.SyslogTestConfig.test_syslog_startup_config": {
+ "duration": 2.7721827030181885,
+ "status": "PASSED"
+ },
+ "opengl.GraphicTest.test_graphic_opengl_with_glxgears": {
+ "duration": 2.2093377113342285,
+ "status": "PASSED"
+ },
+ "opkg.OpkgRepoTest.test_opkg_install_from_repo": {
+ "duration": 0.0008318424224853516,
+ "log": "Test requires opkg to be installed",
+ "status": "SKIPPED"
+ },
+ "pam.PamBasicTest.test_pam": {
+ "duration": 0.0009632110595703125,
+ "log": "Test requires pam to be in DISTRO_FEATURES",
+ "status": "SKIPPED"
+ },
+ "parselogs.ParseLogsTest.test_parselogs": {
+ "duration": 2.461993932723999,
+ "log": "Traceback (most recent call last):\n File \"/home/pokybuild/yocto-autobuilder-new/yocto-worker/E2E-genericx86-64-linux-yocto/build/meta/lib/oeqa/core/decorator/__init__.py\", line 36, in wrapped_f\n return func(*args, **kwargs)\n File \"/home/pokybuild/yocto-autobuilder-new/yocto-worker/E2E-genericx86-64-linux-yocto/build/meta/lib/oeqa/runtime/cases/parselogs.py\", line 384, in test_parselogs\n self.assertEqual(errcount, 0, msg=self.msg)\nAssertionError: 6 != 0 : Log: /home/pokybuild/yocto-autobuilder-new/yocto-worker/E2E-genericx86-64-linux-yocto/build/build/tmp-skylake/work/genericx86_64-poky-linux/core-image-sato-sdk/1.0-r0/target_logs/dmesg\n-----------------------\nCentral error: [ 4.684691] i915 0000:00:02.0: [drm] Cannot find any crtc or sizes\n***********************\n[ 4.031282] i915 0000:00:02.0: vgaarb: changed VGA decodes: olddecodes=io+mem,decodes=io+mem:owns=io+mem\n[ 4.041253] i915 0000:00:02.0: [drm] Finished loading DMC firmware i915/skl_dmc_ver1_27.bin (v1.27)\n[ 4.049101] snd_hda_intel 0000:00:1f.3: enabling device (0000 -> 0002)\n[ 4.055271] EXT4-fs (nvme0n1): recovery complete\n[ 4.058628] EXT4-fs (nvme0n1): mounted filesystem with ordered data mode. Opts: (null)\n[ 4.323268] i915 0000:00:02.0: [drm] failed to retrieve link info, disabling eDP\n[ 4.639090] [drm] Initialized i915 1.6.0 20200917 for 0000:00:02.0 on minor 0\n[ 4.646364] ACPI: Video Device [GFX0] (multi-head: yes rom: no post: no)\n[ 4.652142] input: Video Bus as /devices/LNXSYSTM:00/LNXSYBUS:00/PNP0A08:00/LNXVIDEO:00/input/input3\n[ 4.660275] snd_hda_intel 0000:00:1f.3: bound 0000:00:02.0 (ops i915_audio_component_bind_ops [i915])\n[ 4.684691] i915 0000:00:02.0: [drm] Cannot find any crtc or sizes\n[ 4.698718] EXT4-fs (sda2): re-mounted. Opts: (null)\n[ 4.702867] i915 0000:00:02.0: [drm] Cannot find any crtc or sizes\n[ 4.711104] snd_hda_codec_realtek hdaudioC0D0: autoconfig for ALC233: line_outs=1 (0x1b/0x0/0x0/0x0/0x0) type:speaker\n[ 4.720468] i915 0000:00:02.0: [drm] Cannot find any crtc or sizes\n[ 4.720475] snd_hda_codec_realtek hdaudioC0D0: speaker_outs=0 (0x0/0x0/0x0/0x0/0x0)\n[ 4.731891] snd_hda_codec_realtek hdaudioC0D0: hp_outs=1 (0x21/0x0/0x0/0x0/0x0)\n[ 4.738165] snd_hda_codec_realtek hdaudioC0D0: mono: mono_out=0x0\n[ 4.743357] snd_hda_codec_realtek hdaudioC0D0: dig-out=0x1e/0x0\n[ 4.748347] snd_hda_codec_realtek hdaudioC0D0: inputs:\n[ 4.752570] snd_hda_codec_realtek hdaudioC0D0: Headset Mic=0x19\n\n***********************\nCentral error: [ 4.702867] i915 0000:00:02.0: [drm] Cannot find any crtc or sizes\n***********************\n[ 4.049101] snd_hda_intel 0000:00:1f.3: enabling device (0000 -> 0002)\n[ 4.055271] EXT4-fs (nvme0n1): recovery complete\n[ 4.058628] EXT4-fs (nvme0n1): mounted filesystem with ordered data mode. Opts: (null)\n[ 4.323268] i915 0000:00:02.0: [drm] failed to retrieve link info, disabling eDP\n[ 4.639090] [drm] Initialized i915 1.6.0 20200917 for 0000:00:02.0 on minor 0\n[ 4.646364] ACPI: Video Device [GFX0] (multi-head: yes rom: no post: no)\n[ 4.652142] input: Video Bus as /devices/LNXSYSTM:00/LNXSYBUS:00/PNP0A08:00/LNXVIDEO:00/input/input3\n[ 4.660275] snd_hda_intel 0000:00:1f.3: bound 0000:00:02.0 (ops i915_audio_component_bind_ops [i915])\n[ 4.684691] i915 0000:00:02.0: [drm] Cannot find any crtc or sizes\n[ 4.698718] EXT4-fs (sda2): re-mounted. Opts: (null)\n[ 4.702867] i915 0000:00:02.0: [drm] Cannot find any crtc or sizes\n[ 4.711104] snd_hda_codec_realtek hdaudioC0D0: autoconfig for ALC233: line_outs=1 (0x1b/0x0/0x0/0x0/0x0) type:speaker\n[ 4.720468] i915 0000:00:02.0: [drm] Cannot find any crtc or sizes\n[ 4.720475] snd_hda_codec_realtek hdaudioC0D0: speaker_outs=0 (0x0/0x0/0x0/0x0/0x0)\n[ 4.731891] snd_hda_codec_realtek hdaudioC0D0: hp_outs=1 (0x21/0x0/0x0/0x0/0x0)\n[ 4.738165] snd_hda_codec_realtek hdaudioC0D0: mono: mono_out=0x0\n[ 4.743357] snd_hda_codec_realtek hdaudioC0D0: dig-out=0x1e/0x0\n[ 4.748347] snd_hda_codec_realtek hdaudioC0D0: inputs:\n[ 4.752570] snd_hda_codec_realtek hdaudioC0D0: Headset Mic=0x19\n[ 4.757744] snd_hda_codec_realtek hdaudioC0D0: Headphone Mic=0x1a\n[ 4.825952] input: HDA Intel PCH Headphone Mic as /devices/pci0000:00/0000:00:1f.3/sound/card0/input4\n\n***********************\nCentral error: [ 4.720468] i915 0000:00:02.0: [drm] Cannot find any crtc or sizes\n***********************\n[ 4.058628] EXT4-fs (nvme0n1): mounted filesystem with ordered data mode. Opts: (null)\n[ 4.323268] i915 0000:00:02.0: [drm] failed to retrieve link info, disabling eDP\n[ 4.639090] [drm] Initialized i915 1.6.0 20200917 for 0000:00:02.0 on minor 0\n[ 4.646364] ACPI: Video Device [GFX0] (multi-head: yes rom: no post: no)\n[ 4.652142] input: Video Bus as /devices/LNXSYSTM:00/LNXSYBUS:00/PNP0A08:00/LNXVIDEO:00/input/input3\n[ 4.660275] snd_hda_intel 0000:00:1f.3: bound 0000:00:02.0 (ops i915_audio_component_bind_ops [i915])\n[ 4.684691] i915 0000:00:02.0: [drm] Cannot find any crtc or sizes\n[ 4.698718] EXT4-fs (sda2): re-mounted. Opts: (null)\n[ 4.702867] i915 0000:00:02.0: [drm] Cannot find any crtc or sizes\n[ 4.711104] snd_hda_codec_realtek hdaudioC0D0: autoconfig for ALC233: line_outs=1 (0x1b/0x0/0x0/0x0/0x0) type:speaker\n[ 4.720468] i915 0000:00:02.0: [drm] Cannot find any crtc or sizes\n[ 4.720475] snd_hda_codec_realtek hdaudioC0D0: speaker_outs=0 (0x0/0x0/0x0/0x0/0x0)\n[ 4.731891] snd_hda_codec_realtek hdaudioC0D0: hp_outs=1 (0x21/0x0/0x0/0x0/0x0)\n[ 4.738165] snd_hda_codec_realtek hdaudioC0D0: mono: mono_out=0x0\n[ 4.743357] snd_hda_codec_realtek hdaudioC0D0: dig-out=0x1e/0x0\n[ 4.748347] snd_hda_codec_realtek hdaudioC0D0: inputs:\n[ 4.752570] snd_hda_codec_realtek hdaudioC0D0: Headset Mic=0x19\n[ 4.757744] snd_hda_codec_realtek hdaudioC0D0: Headphone Mic=0x1a\n[ 4.825952] input: HDA Intel PCH Headphone Mic as /devices/pci0000:00/0000:00:1f.3/sound/card0/input4\n[ 4.834373] input: HDA Intel PCH Speaker as /devices/pci0000:00/0000:00:1f.3/sound/card0/input5\n[ 4.842224] input: HDA Intel PCH HDMI/DP,pcm=3 as /devices/pci0000:00/0000:00:1f.3/sound/card0/input6\n\n***********************\nLog: /home/pokybuild/yocto-autobuilder-new/yocto-worker/E2E-genericx86-64-linux-yocto/build/build/tmp-skylake/work/genericx86_64-poky-linux/core-image-sato-sdk/1.0-r0/target_logs/dmesg_output.log\n-----------------------\nCentral error: [ 4.684691] i915 0000:00:02.0: [drm] Cannot find any crtc or sizes\n***********************\n[ 4.031282] i915 0000:00:02.0: vgaarb: changed VGA decodes: olddecodes=io+mem,decodes=io+mem:owns=io+mem\n[ 4.041253] i915 0000:00:02.0: [drm] Finished loading DMC firmware i915/skl_dmc_ver1_27.bin (v1.27)\n[ 4.049101] snd_hda_intel 0000:00:1f.3: enabling device (0000 -> 0002)\n[ 4.055271] EXT4-fs (nvme0n1): recovery complete\n[ 4.058628] EXT4-fs (nvme0n1): mounted filesystem with ordered data mode. Opts: (null)\n[ 4.323268] i915 0000:00:02.0: [drm] failed to retrieve link info, disabling eDP\n[ 4.639090] [drm] Initialized i915 1.6.0 20200917 for 0000:00:02.0 on minor 0\n[ 4.646364] ACPI: Video Device [GFX0] (multi-head: yes rom: no post: no)\n[ 4.652142] input: Video Bus as /devices/LNXSYSTM:00/LNXSYBUS:00/PNP0A08:00/LNXVIDEO:00/input/input3\n[ 4.660275] snd_hda_intel 0000:00:1f.3: bound 0000:00:02.0 (ops i915_audio_component_bind_ops [i915])\n[ 4.684691] i915 0000:00:02.0: [drm] Cannot find any crtc or sizes\n[ 4.698718] EXT4-fs (sda2): re-mounted. Opts: (null)\n[ 4.702867] i915 0000:00:02.0: [drm] Cannot find any crtc or sizes\n[ 4.711104] snd_hda_codec_realtek hdaudioC0D0: autoconfig for ALC233: line_outs=1 (0x1b/0x0/0x0/0x0/0x0) type:speaker\n[ 4.720468] i915 0000:00:02.0: [drm] Cannot find any crtc or sizes\n[ 4.720475] snd_hda_codec_realtek hdaudioC0D0: speaker_outs=0 (0x0/0x0/0x0/0x0/0x0)\n[ 4.731891] snd_hda_codec_realtek hdaudioC0D0: hp_outs=1 (0x21/0x0/0x0/0x0/0x0)\n[ 4.738165] snd_hda_codec_realtek hdaudioC0D0: mono: mono_out=0x0\n[ 4.743357] snd_hda_codec_realtek hdaudioC0D0: dig-out=0x1e/0x0\n[ 4.748347] snd_hda_codec_realtek hdaudioC0D0: inputs:\n[ 4.752570] snd_hda_codec_realtek hdaudioC0D0: Headset Mic=0x19\n\n***********************\nCentral error: [ 4.702867] i915 0000:00:02.0: [drm] Cannot find any crtc or sizes\n***********************\n[ 4.049101] snd_hda_intel 0000:00:1f.3: enabling device (0000 -> 0002)\n[ 4.055271] EXT4-fs (nvme0n1): recovery complete\n[ 4.058628] EXT4-fs (nvme0n1): mounted filesystem with ordered data mode. Opts: (null)\n[ 4.323268] i915 0000:00:02.0: [drm] failed to retrieve link info, disabling eDP\n[ 4.639090] [drm] Initialized i915 1.6.0 20200917 for 0000:00:02.0 on minor 0\n[ 4.646364] ACPI: Video Device [GFX0] (multi-head: yes rom: no post: no)\n[ 4.652142] input: Video Bus as /devices/LNXSYSTM:00/LNXSYBUS:00/PNP0A08:00/LNXVIDEO:00/input/input3\n[ 4.660275] snd_hda_intel 0000:00:1f.3: bound 0000:00:02.0 (ops i915_audio_component_bind_ops [i915])\n[ 4.684691] i915 0000:00:02.0: [drm] Cannot find any crtc or sizes\n[ 4.698718] EXT4-fs (sda2): re-mounted. Opts: (null)\n[ 4.702867] i915 0000:00:02.0: [drm] Cannot find any crtc or sizes\n[ 4.711104] snd_hda_codec_realtek hdaudioC0D0: autoconfig for ALC233: line_outs=1 (0x1b/0x0/0x0/0x0/0x0) type:speaker\n[ 4.720468] i915 0000:00:02.0: [drm] Cannot find any crtc or sizes\n[ 4.720475] snd_hda_codec_realtek hdaudioC0D0: speaker_outs=0 (0x0/0x0/0x0/0x0/0x0)\n[ 4.731891] snd_hda_codec_realtek hdaudioC0D0: hp_outs=1 (0x21/0x0/0x0/0x0/0x0)\n[ 4.738165] snd_hda_codec_realtek hdaudioC0D0: mono: mono_out=0x0\n[ 4.743357] snd_hda_codec_realtek hdaudioC0D0: dig-out=0x1e/0x0\n[ 4.748347] snd_hda_codec_realtek hdaudioC0D0: inputs:\n[ 4.752570] snd_hda_codec_realtek hdaudioC0D0: Headset Mic=0x19\n[ 4.757744] snd_hda_codec_realtek hdaudioC0D0: Headphone Mic=0x1a\n[ 4.825952] input: HDA Intel PCH Headphone Mic as /devices/pci0000:00/0000:00:1f.3/sound/card0/input4\n\n***********************\nCentral error: [ 4.720468] i915 0000:00:02.0: [drm] Cannot find any crtc or sizes\n***********************\n[ 4.058628] EXT4-fs (nvme0n1): mounted filesystem with ordered data mode. Opts: (null)\n[ 4.323268] i915 0000:00:02.0: [drm] failed to retrieve link info, disabling eDP\n[ 4.639090] [drm] Initialized i915 1.6.0 20200917 for 0000:00:02.0 on minor 0\n[ 4.646364] ACPI: Video Device [GFX0] (multi-head: yes rom: no post: no)\n[ 4.652142] input: Video Bus as /devices/LNXSYSTM:00/LNXSYBUS:00/PNP0A08:00/LNXVIDEO:00/input/input3\n[ 4.660275] snd_hda_intel 0000:00:1f.3: bound 0000:00:02.0 (ops i915_audio_component_bind_ops [i915])\n[ 4.684691] i915 0000:00:02.0: [drm] Cannot find any crtc or sizes\n[ 4.698718] EXT4-fs (sda2): re-mounted. Opts: (null)\n[ 4.702867] i915 0000:00:02.0: [drm] Cannot find any crtc or sizes\n[ 4.711104] snd_hda_codec_realtek hdaudioC0D0: autoconfig for ALC233: line_outs=1 (0x1b/0x0/0x0/0x0/0x0) type:speaker\n[ 4.720468] i915 0000:00:02.0: [drm] Cannot find any crtc or sizes\n[ 4.720475] snd_hda_codec_realtek hdaudioC0D0: speaker_outs=0 (0x0/0x0/0x0/0x0/0x0)\n[ 4.731891] snd_hda_codec_realtek hdaudioC0D0: hp_outs=1 (0x21/0x0/0x0/0x0/0x0)\n[ 4.738165] snd_hda_codec_realtek hdaudioC0D0: mono: mono_out=0x0\n[ 4.743357] snd_hda_codec_realtek hdaudioC0D0: dig-out=0x1e/0x0\n[ 4.748347] snd_hda_codec_realtek hdaudioC0D0: inputs:\n[ 4.752570] snd_hda_codec_realtek hdaudioC0D0: Headset Mic=0x19\n[ 4.757744] snd_hda_codec_realtek hdaudioC0D0: Headphone Mic=0x1a\n[ 4.825952] input: HDA Intel PCH Headphone Mic as /devices/pci0000:00/0000:00:1f.3/sound/card0/input4\n[ 4.834373] input: HDA Intel PCH Speaker as /devices/pci0000:00/0000:00:1f.3/sound/card0/input5\n[ 4.842224] input: HDA Intel PCH HDMI/DP,pcm=3 as /devices/pci0000:00/0000:00:1f.3/sound/card0/input6\n\n***********************\n6 errors found in logs.\n\nStdout:\nMachine information: \n*******************************\nMachine name: genericx86-64\nCPU: Intel(R) Core(TM) i7-6770HQ CPU @ 2.60GHz\nArch: x86_64\nPhysical cores: 4\nLogical cores: 8\n*******************************\n\n",
+ "status": "FAILED"
+ },
+ "perl.PerlTest.test_perl_works": {
+ "duration": 0.11979866027832031,
+ "status": "PASSED"
+ },
+ "ping.PingTest.test_ping": {
+ "duration": 0.04921698570251465,
+ "status": "PASSED"
+ },
+ "python.PythonTest.test_python3": {
+ "duration": 0.14371371269226074,
+ "status": "PASSED"
+ },
+ "rpm.RpmBasicTest.test_rpm_help": {
+ "duration": 0.11801624298095703,
+ "status": "PASSED"
+ },
+ "rpm.RpmBasicTest.test_rpm_query": {
+ "duration": 0.28045201301574707,
+ "status": "PASSED"
+ },
+ "rpm.RpmBasicTest.test_rpm_query_nonroot": {
+ "duration": 1.052046537399292,
+ "status": "PASSED"
+ },
+ "rpm.RpmInstallRemoveTest.test_check_rpm_install_removal_log_file_size": {
+ "duration": 4.723294734954834,
+ "status": "PASSED"
+ },
+ "rpm.RpmInstallRemoveTest.test_rpm_install": {
+ "duration": 0.5041582584381104,
+ "status": "PASSED"
+ },
+ "rpm.RpmInstallRemoveTest.test_rpm_remove": {
+ "duration": 0.22808456420898438,
+ "status": "PASSED"
+ },
+ "rpmextra.RpmExtraTest.test_rpm_install_dependency": {
+ "duration": 1.3131377696990967,
+ "status": "PASSED"
+ },
+ "scp.ScpTest.test_scp_file": {
+ "duration": 0.4044811725616455,
+ "status": "PASSED"
+ },
+ "ssh.SSHTest.test_ssh": {
+ "duration": 0.19924283027648926,
+ "status": "PASSED"
+ },
+ "stap.StapTest.test_stap": {
+ "duration": 7.277251243591309,
+ "log": "Traceback (most recent call last):\n File \"/home/pokybuild/yocto-autobuilder-new/yocto-worker/E2E-genericx86-64-linux-yocto/build/meta/lib/oeqa/core/decorator/__init__.py\", line 36, in wrapped_f\n return func(*args, **kwargs)\n File \"/home/pokybuild/yocto-autobuilder-new/yocto-worker/E2E-genericx86-64-linux-yocto/build/meta/lib/oeqa/core/decorator/__init__.py\", line 36, in wrapped_f\n return func(*args, **kwargs)\n File \"/home/pokybuild/yocto-autobuilder-new/yocto-worker/E2E-genericx86-64-linux-yocto/build/meta/lib/oeqa/core/decorator/__init__.py\", line 36, in wrapped_f\n return func(*args, **kwargs)\n File \"/home/pokybuild/yocto-autobuilder-new/yocto-worker/E2E-genericx86-64-linux-yocto/build/meta/lib/oeqa/runtime/cases/stap.py\", line 37, in test_stap\n self.assertEqual(status, 0, msg='\\n'.join([cmd, output]))\nAssertionError: 1 != 0 : stap --disable-cache -DSTP_NO_VERREL_CHECK /tmp/hello.stp\nWARNING: Kernel function symbol table missing [man warning::symbols]\nIn file included from /usr/share/systemtap/runtime/linux/../regs.c:20,\n from /usr/share/systemtap/runtime/linux/runtime.h:251,\n from /usr/share/systemtap/runtime/runtime.h:26,\n from /tmp/stapCVl4hg/stap_22395_src.c:21:\n/usr/share/systemtap/runtime/linux/../linux/regs.c: In function '_stp_print_regs':\n/usr/share/systemtap/runtime/linux/../linux/regs.c:48:33: error: 'struct pt_regs' has no member named 'rip'; did you mean 'ip'?\n 48 | #define RREG(nm, regs) ((regs)->r##nm)\n | ^\n/usr/share/systemtap/runtime/linux/../linux/regs.c:58:4: note: in expansion of macro 'RREG'\n 58 | RREG(ip, regs), RREG(sp, regs), EREG(flags, regs));\n | ^~~~\n/usr/share/systemtap/runtime/linux/../linux/regs.c:48:33: error: 'struct pt_regs' has no member named 'rsp'; did you mean 'sp'?\n 48 | #define RREG(nm, regs) ((regs)->r##nm)\n | ^\n/usr/share/systemtap/runtime/linux/../linux/regs.c:58:20: note: in expansion of macro 'RREG'\n 58 | RREG(ip, regs), RREG(sp, regs), EREG(flags, regs));\n | ^~~~\n/usr/share/systemtap/runtime/linux/../linux/regs.c:47:33: error: 'struct pt_regs' has no member named 'eflags'; did you mean 'flags'?\n 47 | #define EREG(nm, regs) ((regs)->e##nm)\n | ^\n/usr/share/systemtap/runtime/linux/../linux/regs.c:58:36: note: in expansion of macro 'EREG'\n 58 | RREG(ip, regs), RREG(sp, regs), EREG(flags, regs));\n | ^~~~\n/usr/share/systemtap/runtime/linux/../linux/regs.c:48:33: error: 'struct pt_regs' has no member named 'rax'; did you mean 'ax'?\n 48 | #define RREG(nm, regs) ((regs)->r##nm)\n | ^\n/usr/share/systemtap/runtime/linux/../linux/regs.c:60:4: note: in expansion of macro 'RREG'\n 60 | RREG(ax, regs), RREG(bx, regs), RREG(cx, regs));\n | ^~~~\n/usr/share/systemtap/runtime/linux/../linux/regs.c:48:33: error: 'struct pt_regs' has no member named 'rbx'; did you mean 'bx'?\n 48 | #define RREG(nm, regs) ((regs)->r##nm)\n | ^\n/usr/share/systemtap/runtime/linux/../linux/regs.c:60:20: note: in expansion of macro 'RREG'\n 60 | RREG(ax, regs), RREG(bx, regs), RREG(cx, regs));\n | ^~~~\n/usr/share/systemtap/runtime/linux/../linux/regs.c:48:33: error: 'struct pt_regs' has no member named 'rcx'; did you mean 'cx'?\n 48 | #define RREG(nm, regs) ((regs)->r##nm)\n | ^\n/usr/share/systemtap/runtime/linux/../linux/regs.c:60:36: note: in expansion of macro 'RREG'\n 60 | RREG(ax, regs), RREG(bx, regs), RREG(cx, regs));\n | ^~~~\n/usr/share/systemtap/runtime/linux/../linux/regs.c:48:33: error: 'struct pt_regs' has no member named 'rdx'; did you mean 'dx'?\n 48 | #define RREG(nm, regs) ((regs)->r##nm)\n | ^\n/usr/share/systemtap/runtime/linux/../linux/regs.c:62:4: note: in expansion of macro 'RREG'\n 62 | RREG(dx, regs), RREG(si, regs), RREG(di, regs));\n | ^~~~\n/usr/share/systemtap/runtime/linux/../linux/regs.c:48:33: error: 'struct pt_regs' has no member named 'rsi'; did you mean 'si'?\n 48 | #define RREG(nm, regs) ((regs)->r##nm)\n | ^\n/usr/share/systemtap/runtime/linux/../linux/regs.c:62:20: note: in expansion of macro 'RREG'\n 62 | RREG(dx, regs), RREG(si, regs), RREG(di, regs));\n | ^~~~\n/usr/share/systemtap/runtime/linux/../linux/regs.c:48:33: error: 'struct pt_regs' has no member named 'rdi'; did you mean 'di'?\n 48 | #define RREG(nm, regs) ((regs)->r##nm)\n | ^\n/usr/share/systemtap/runtime/linux/../linux/regs.c:62:36: note: in expansion of macro 'RREG'\n 62 | RREG(dx, regs), RREG(si, regs), RREG(di, regs));\n | ^~~~\n/usr/share/systemtap/runtime/linux/../linux/regs.c:48:33: error: 'struct pt_regs' has no member named 'rbp'; did you mean 'bp'?\n 48 | #define RREG(nm, regs) ((regs)->r##nm)\n | ^\n/usr/share/systemtap/runtime/linux/../linux/regs.c:64:4: note: in expansion of macro 'RREG'\n 64 | RREG(bp, regs), regs->r8, regs->r9);\n | ^~~~\n/usr/share/systemtap/runtime/linux/../regs.c: In function '_stp_get_sp':\n/usr/share/systemtap/runtime/linux/../linux/regs.c:48:33: error: 'struct pt_regs' has no member named 'rsp'; did you mean 'sp'?\n 48 | #define RREG(nm, regs) ((regs)->r##nm)\n | ^\n/usr/share/systemtap/runtime/linux/../regs.c:57:9: note: in expansion of macro 'RREG'\n 57 | return RREG(sp, regs);\n | ^~~~\n/usr/share/systemtap/runtime/linux/../regs.c: In function '_stp_get_arg32_by_number':\n/usr/share/systemtap/runtime/linux/../linux/regs.c:48:33: error: 'struct pt_regs' has no member named 'rax'; did you mean 'ax'?\n 48 | #define RREG(nm, regs) ((regs)->r##nm)\n | ^\n/usr/share/systemtap/runtime/linux/../regs.c:104:25: note: in expansion of macro 'RREG'\n 104 | #define ERREG(nm, regs) RREG(nm, regs)\n | ^~~~\n/usr/share/systemtap/runtime/linux/../regs.c:123:28: note: in expansion of macro 'ERREG'\n 123 | case 1: *val = (int32_t)(ERREG(ax, regs)); break;\n | ^~~~~\n/usr/share/systemtap/runtime/linux/../linux/regs.c:48:33: error: 'struct pt_regs' has no member named 'rdx'; did you mean 'dx'?\n 48 | #define RREG(nm, regs) ((regs)->r##nm)\n | ^\n/usr/share/systemtap/runtime/linux/../regs.c:104:25: note: in expansion of macro 'RREG'\n 104 | #define ERREG(nm, regs) RREG(nm, regs)\n | ^~~~\n/usr/share/systemtap/runtime/linux/../regs.c:124:28: note: in expansion of macro 'ERREG'\n 124 | case 2: *val = (int32_t)(ERREG(dx, regs)); break;\n | ^~~~~\n/usr/share/systemtap/runtime/linux/../linux/regs.c:48:33: error: 'struct pt_regs' has no member named 'rcx'; did you mean 'cx'?\n 48 | #define RREG(nm, regs) ((regs)->r##nm)\n | ^\n/usr/share/systemtap/runtime/linux/../regs.c:104:25: note: in expansion of macro 'RREG'\n 104 | #define ERREG(nm, regs) RREG(nm, regs)\n | ^~~~\n/usr/share/systemtap/runtime/linux/../regs.c:125:28: note: in expansion of macro 'ERREG'\n 125 | case 3: *val = (int32_t)(ERREG(cx, regs)); break;\n | ^~~~~\n/usr/share/systemtap/runtime/linux/../regs.c: In function '_stp_get_arg64_by_number':\n/usr/share/systemtap/runtime/linux/../linux/regs.c:48:33: error: 'struct pt_regs' has no member named 'rdi'; did you mean 'di'?\n 48 | #define RREG(nm, regs) ((regs)->r##nm)\n | ^\n/usr/share/systemtap/runtime/linux/../regs.c:150:18: note: in expansion of macro 'RREG'\n 150 | case 1: *val = RREG(di, regs); break;\n | ^~~~\n/usr/share/systemtap/runtime/linux/../linux/regs.c:48:33: error: 'struct pt_regs' has no member named 'rsi'; did you mean 'si'?\n 48 | #define RREG(nm, regs) ((regs)->r##nm)\n | ^\n/usr/share/systemtap/runtime/linux/../regs.c:151:18: note: in expansion of macro 'RREG'\n 151 | case 2: *val = RREG(si, regs); break;\n | ^~~~\n/usr/share/systemtap/runtime/linux/../linux/regs.c:48:33: error: 'struct pt_regs' has no member named 'rdx'; did you mean 'dx'?\n 48 | #define RREG(nm, regs) ((regs)->r##nm)\n | ^\n/usr/share/systemtap/runtime/linux/../regs.c:152:18: note: in expansion of macro 'RREG'\n 152 | case 3: *val = RREG(dx, regs); break;\n | ^~~~\n/usr/share/systemtap/runtime/linux/../linux/regs.c:48:33: error: 'struct pt_regs' has no member named 'rcx'; did you mean 'cx'?\n 48 | #define RREG(nm, regs) ((regs)->r##nm)\n | ^\n/usr/share/systemtap/runtime/linux/../regs.c:153:18: note: in expansion of macro 'RREG'\n 153 | case 4: *val = RREG(cx, regs); break;\n | ^~~~\nmake[1]: *** [scripts/Makefile.build:279: /tmp/stapCVl4hg/stap_22395_src.o] Error 1\nmake: *** [Makefile:1821: /tmp/stapCVl4hg] Error 2\nWARNING: kbuild exited with status: 2\nPass 4: compilation failed. [man error::pass4]\n",
+ "status": "FAILED"
+ },
+ "systemd.SystemdBasicTests.test_systemd_basic": {
+ "duration": 0.0007727146148681641,
+ "log": "systemd is not the init manager for this image",
+ "status": "SKIPPED"
+ },
+ "systemd.SystemdBasicTests.test_systemd_failed": {
+ "duration": 0.0006034374237060547,
+ "log": "Test case systemd.SystemdBasicTests.test_systemd_failed depends on systemd.SystemdBasicTests.test_systemd_basic but it didn't pass/run.",
+ "status": "SKIPPED"
+ },
+ "systemd.SystemdBasicTests.test_systemd_list": {
+ "duration": 0.00047898292541503906,
+ "log": "Test case systemd.SystemdBasicTests.test_systemd_list depends on systemd.SystemdBasicTests.test_systemd_basic but it didn't pass/run.",
+ "status": "SKIPPED"
+ },
+ "systemd.SystemdJournalTests.test_systemd_boot_time": {
+ "duration": 0.0005018711090087891,
+ "log": "Test case systemd.SystemdJournalTests.test_systemd_boot_time depends on systemd.SystemdBasicTests.test_systemd_basic but it didn't pass/run.",
+ "status": "SKIPPED"
+ },
+ "systemd.SystemdJournalTests.test_systemd_journal": {
+ "duration": 0.0005090236663818359,
+ "log": "Test case systemd.SystemdJournalTests.test_systemd_journal depends on systemd.SystemdBasicTests.test_systemd_basic but it didn't pass/run.",
+ "status": "SKIPPED"
+ },
+ "systemd.SystemdServiceTests.test_systemd_disable_enable": {
+ "duration": 0.0006632804870605469,
+ "log": "Test case systemd.SystemdServiceTests.test_systemd_disable_enable depends on systemd.SystemdServiceTests.test_systemd_status but it didn't pass/run.",
+ "status": "SKIPPED"
+ },
+ "systemd.SystemdServiceTests.test_systemd_disable_enable_ro": {
+ "duration": 0.0005276203155517578,
+ "log": "Test is only meant to run with read-only-rootfs in IMAGE_FEATURES",
+ "status": "SKIPPED"
+ },
+ "systemd.SystemdServiceTests.test_systemd_status": {
+ "duration": 0.0005040168762207031,
+ "log": "Test case systemd.SystemdServiceTests.test_systemd_status depends on systemd.SystemdBasicTests.test_systemd_basic but it didn't pass/run.",
+ "status": "SKIPPED"
+ },
+ "systemd.SystemdServiceTests.test_systemd_stop_start": {
+ "duration": 0.00046634674072265625,
+ "log": "Test case systemd.SystemdServiceTests.test_systemd_stop_start depends on systemd.SystemdServiceTests.test_systemd_status but it didn't pass/run.",
+ "status": "SKIPPED"
+ },
+ "weston.WestonTest.test_wayland_info": {
+ "duration": 0.0006208419799804688,
+ "log": "Test requires wayland-utils to be installed",
+ "status": "SKIPPED"
+ },
+ "weston.WestonTest.test_weston_can_initialize_new_wayland_compositor": {
+ "duration": 0.0005335807800292969,
+ "log": "Test requires weston to be installed",
+ "status": "SKIPPED"
+ },
+ "weston.WestonTest.test_weston_running": {
+ "duration": 0.0005199909210205078,
+ "log": "Test requires weston to be installed",
+ "status": "SKIPPED"
+ },
+ "xorg.XorgTest.test_xorg_running": {
+ "duration": 0.265639066696167,
+ "status": "PASSED"
+ }
+ }
+ }
+} \ No newline at end of file